program: Gaussian 09
title: 000239735
version: EM64L-G09RevD.01
frameworkgroup: C1[X(C15H22ClNO)]
method: RPBEPBE
basis: SDD
operation: Freq
keyword: #p
keyword: freq=noraman
keyword: PBEPBE/SDD
title: #p freq=noraman PBEPBE/SDD
converged: NO YES NO NO
title: Mulliken charges:
elementType: Cl O N C C C C C C C C C C C C C C C H H H H H H H H H H H H H H H H H H H H H H
charge: -0.099302 -0.432780 -0.270160 -0.394080 -0.377654 -0.454755 -0.440536 -0.501599 0.174618 -0.119299 0.383038 0.487040 -0.241330 -0.380434 -0.423756 -0.832576 -0.701842 -0.703523 0.237090 0.229703 0.237475 0.253577 0.238444 0.228393 0.228600 0.232222 0.248193 0.238816 0.269005 0.258408 0.233280 0.257385 0.222252 0.207260 0.209999 0.228674 0.225342 0.210624 0.208254 0.425932
chargesum: 0.00000
title: Mulliken charges with hydrogens summed into heavy atoms:
elementType: Cl O N C C C C C C C C C C C C C C C
charge: -0.099302 -0.006848 -0.270160 0.072713 0.113399 0.012083 0.020286 -0.014590 0.174618 -0.119299 0.383038 0.487040 0.027675 -0.380434 -0.165348 -0.119659 -0.055909 -0.059303
polarizability: 2.23779792e+02 2.66458741e-01 1.98714801e+02 -9.10916603e+00 9.91222213e-01 1.26548322e+02
1716.lowfreq: -9.6384 -4.1138 -0.0004 0.0020 0.0027 3.2548 27.8887 40.6992 43.0803
frequency: 26.9441 40.6321 42.6963 60.8697 78.6258 89.5309 117.2760 133.2254 141.8858 155.2225 182.6767 216.3960 236.2122 247.3147 252.9974 274.8084 294.7049 305.9763 328.2399 342.5812 384.2577 416.9691 422.3489 445.9319 503.7018 540.7783 566.1069 611.3527 631.5731 638.6675 673.5519 705.9761 734.8582 762.9224 795.3184 829.2184 834.1480 861.5635 886.3853 886.6826 914.7319 921.8852 936.9223 943.0758 955.5454 966.7712 990.7537 1006.9593 1037.1045 1051.7251 1052.2775 1061.9725 1086.6271 1108.4533 1115.4499 1161.9232 1175.6295 1186.2340 1196.2982 1202.4887 1222.8322 1224.6816 1249.3262 1271.2926 1282.0760 1292.6975 1304.5964 1311.1124 1316.6024 1326.1448 1332.1464 1335.5505 1371.1520 1376.3870 1395.7394 1396.7560 1400.6611 1448.9057 1458.4879 1466.6327 1468.0324 1469.1826 1471.5355 1475.5754 1477.3218 1480.2495 1487.0186 1488.3005 1492.3847 1535.9831 1575.0106 1625.8084 2277.6696 2965.6715 2970.9744 2973.7963 2975.4572 3007.1144 3011.1670 3014.2556 3020.8887 3027.3203 3027.6146 3047.2917 3061.9462 3062.7752 3072.2925 3075.4691 3080.0645 3080.8668 3088.6611 3099.5022 3108.3581 3150.9568
redmass: 2.8404 4.4116 2.5089 2.3295 2.9889 2.8872 2.2260 1.8187 3.7769 2.1721 4.5788 1.0667 1.8509 2.3574 1.9518 2.6953 3.3268 3.8433 3.0430 4.8232 2.7064 4.5584 2.8846 4.0422 3.4578 3.9965 4.0951 3.7831 5.2426 2.7386 2.4365 3.2665 3.8655 3.8557 2.5288 2.2026 1.9836 3.0206 1.5814 2.6824 2.7142 1.2113 1.8241 2.8487 1.4048 2.2399 1.8078 2.7493 1.5495 2.1291 2.3052 2.2634 1.7199 2.0154 2.6968 2.1050 1.1158 1.2567 1.2277 2.3533 2.0666 1.1397 1.4548 1.3355 4.3513 1.3287 1.3758 1.2916 2.0779 1.3044 1.2862 1.6383 2.8949 1.2043 1.4746 1.7444 1.4180 2.2996 1.1779 1.0496 1.0790 1.0467 1.1407 1.0869 1.0784 1.0545 1.0697 1.0851 1.0934 1.8453 6.5869 2.6023 1.0721 1.0579 1.0348 1.0355 1.0401 1.0616 1.0612 1.0634 1.0983 1.0688 1.0856 1.0975 1.0998 1.1017 1.0980 1.1003 1.1020 1.0991 1.1039 1.1058 1.0953 1.0916
irintensity: 0.3325 0.9507 0.0350 0.3252 0.2002 1.9326 0.2106 2.4829 2.4894 0.5907 4.4768 0.1132 1.3049 2.5098 0.6998 1.3575 1.1003 1.1361 0.6531 8.5881 0.3055 2.5511 0.6597 19.7736 2.5499 5.9052 11.3278 3.8149 1.8181 2.8757 23.6034 10.6271 40.9217 13.4562 23.3512 15.1374 31.0996 1.6957 15.7531 5.4577 8.4858 2.0543 40.7369 6.6779 0.0607 14.3127 1.3364 37.9289 2.7501 47.6249 55.3715 3.8440 10.8713 2.2794 3.4433 16.2182 26.5184 1.5655 7.5144 58.1051 20.6292 7.0816 10.1202 25.6132 11.7775 2.7924 2.4646 4.9023 64.7747 21.4375 0.4619 11.1892 31.3849 16.3646 39.4264 20.6853 8.3033 54.3948 12.8663 1.1288 6.2993 5.0385 52.3729 15.3006 12.1702 10.1401 24.1185 27.6699 5.7382 144.5287 23.1756 130.3796 1678.8953 22.1835 33.8889 56.2795 31.5426 20.5035 36.9801 33.2479 8.9570 45.1853 1.3295 21.2578 0.3959 9.8167 100.6280 26.0228 5.3364 39.3910 12.9848 73.7209 6.3935 3.9375
temp: 298.150 k
press: 1.00000 atm
elementType: 17 8 7 6 6 6 6 6 6 6 6 6 6 6 6 6 6 6 1 1 1 1 1 1 1 1 1 1 1 1 1 1 1 1 1 1 1 1 1 1
symmnumber: 1
zpe: 890047.1 jmol-1
zpe.correction: 0.339001 hartree
zpe.thermalcorrener: 0.358005 hartree
zpe.thermalcorrenthalpy: 0.358949 hartree
zpe.thermalcorrgfe: 0.290575 hartree
zpe.sumelectzpe: -1173.449484 hartree
zpe.sumelectthermal: -1173.430481 hartree
zpe.sumelectthermalent: -1173.429537 hartree
zpe.sumelectthermalfe: -1173.497910 hartree
dipole: 5.8263 0.0686 0.1910
dipole: 5.8298
quadrupole: -102.3779 -122.9673 -116.1355
quadrupole: 5.7049 -0.4794 -2.8994
quadrupole: 11.4490 -9.1404 -2.3086 5.7049 -0.4794 -2.8994
hfenergy: -1173.7884855 hartree
pointgroup: C01 [X(C15H22Cl1N1O1)]
dipole: -2.2907339 0.1152838 -0.0051445 debye
polarizability: 223.1945994|0.9646981|195.6135261|11.5193384|-14.8100179|130.2347889 unknown
InChI: InChI=1S/C15H22ClNO/c1-10(2)12-8-14(16)11(3)13(15(12)18)9-17-6-4-5-7-17/h8,10,18H,4-7,9H2,1-3H3
charge 0 multiplicity 1
40 atoms
Cl 2.747432 -3.190148 1.025412
O  -0.109017 1.794281 -0.795153
N  -2.352008 0.689706 -0.357527
C  -3.691067 0.849078 -1.012407
C  -2.669222 0.766283 1.11099
C  -4.701031 0.060601 -0.122004
C  -4.039356 0.041847 1.297654
C  -1.65324 -0.598321 -0.737272
C  -0.197143 -0.594002 -0.282307
C  0.536012 0.632904 -0.382986
C  0.439736 -1.794785 0.149827
C  1.924392 0.687346 -0.071198
C  2.703419 1.99674 -0.191744
C  1.817232 -1.701212 0.458137
C  2.550251 -0.505778 0.349231
C  -0.327823 -3.103253 0.246064
C  3.843335 1.883475 -1.238721
C  3.260511 2.45296 1.183141
H  -3.65303 0.500665 -2.057847
H  -3.941227 1.925969 -1.017934
H  -2.750478 1.834043 1.384173
H  -1.845733 0.325862 1.696405
H  -4.842047 -0.966026 -0.50281
H  -5.691184 0.547326 -0.113702
H  -4.659217 0.560726 2.048695
H  -3.897105 -0.993873 1.652163
H  -1.693466 -0.649165 -1.844493
H  -2.19574 -1.479744 -0.344823
H  1.987395 2.761069 -0.543311
H  3.616322 -0.504723 0.597637
H  -0.726009 -3.414419 -0.737957
H  0.321293 -3.91215 0.613738
H  -1.186158 -3.020609 0.940093
H  4.591066 1.125148 -0.937879
H  4.368372 2.851369 -1.34494
H  3.446265 1.594814 -2.228457
H  2.448038 2.568925 1.92293
H  3.781912 3.423713 1.085861
H  3.984692 1.719752 1.586266
H  -1.156771 1.581808 -0.710143
