program: Gaussian 09
title: 000239727
version: EM64L-G09RevD.01
frameworkgroup: C1[X(C8H9NO3)]
method: RPBEPBE
basis: SDD
operation: Freq
keyword: #pfreq=noraman
keyword: PBEPBE/SDD
title: #p freq=noraman PBEPBE/SDD
converged: NO YES NO NO
title: Mulliken charges:
elementType: O O O N C C C C C C C C H H H H H H H H H
charge: -0.238856 -0.200942 -0.200941 -0.351532 -0.234175 -0.234174 -0.148578 -0.148579 -0.441933 -0.441934 0.133129 0.133128 0.272231 0.272230 0.279450 0.279450 0.247707 0.211821 0.211822 0.247706 0.352971
chargesum: 0.00000
title: Mulliken charges with hydrogens summed into heavy atoms:
elementType: O O O N C C C C C C C C
charge: -0.238856 -0.200942 -0.200941 0.001439 0.038056 0.038057 0.130872 0.130871 0.017595 0.017594 0.133129 0.133128
polarizability: 9.90625366e+01 8.28269576e-05 1.07358509e+02 -4.53879520e+00 9.56129397e-06 6.60670474e+01
1716.lowfreq: -20.0597 -14.3769 -0.0011 -0.0004 0.0002 3.8605 65.5689 142.9459 170.8029
frequency: 65.3026 142.9428 170.7963 176.3143 245.1180 304.1635 410.5211 469.4665 523.3956 549.1675 600.6500 629.4061 638.9979 717.3551 754.7309 779.8537 791.8472 793.2121 851.0568 874.6254 882.1872 898.3928 904.7046 945.2624 968.8253 982.2350 988.4584 1030.0564 1039.2356 1117.0116 1165.9868 1181.3325 1186.8613 1202.4061 1203.2489 1233.6988 1234.8089 1238.7431 1275.8394 1277.8833 1281.6248 1297.6495 1312.6950 1329.2562 1460.8208 1476.9171 1665.3569 1703.0305 3022.3219 3035.0406 3063.2315 3076.1506 3082.8091 3104.2389 3126.4621 3133.4347 3548.1877
redmass: 4.6637 10.5184 5.0333 4.0025 2.0920 5.4859 4.7108 5.9092 5.6282 4.1609 9.0184 7.5400 3.5720 4.2679 1.3471 5.0913 5.1428 1.9652 2.2367 4.3245 2.7410 3.3464 3.7710 2.9728 3.7822 1.7268 2.1015 2.2531 1.6456 1.1649 1.9569 3.3126 1.2793 1.2925 1.3795 1.5860 1.6031 1.2546 2.6509 1.5192 1.6421 1.9120 1.4502 1.7445 1.0823 1.0941 7.6842 12.6254 1.0591 1.0624 1.0856 1.0873 1.1048 1.1049 1.0891 1.0950 1.0791
irintensity: 0.2010 8.7925 4.2745 0.0802 0.5168 7.5648 23.1457 1.6315 5.9918 11.4292 7.9583 0.0696 10.4090 3.8552 127.5356 13.9599 12.7296 7.3638 12.7153 15.7850 0.0321 1.1605 3.9416 3.3560 27.1658 14.8741 20.7795 1.3920 0.6500 1.9406 49.7232 151.2465 12.7847 0.0476 7.7843 6.4730 62.2367 0.0350 96.1837 8.0667 0.0383 22.1111 2.6627 14.7588 4.6005 11.3215 639.4688 65.0516 25.8581 33.9350 5.9336 5.6067 0.1073 39.3753 17.5028 3.8562 51.9141
temp: 298.150 k
press: 1.00000 atm
elementType: 8 8 8 7 6 6 6 6 6 6 6 6 1 1 1 1 1 1 1 1 1
symmnumber: 1
zpe: 431644.5 jmol-1
zpe.correction: 0.164405 hartree
zpe.thermalcorrener: 0.173402 hartree
zpe.thermalcorrenthalpy: 0.174346 hartree
zpe.thermalcorrgfe: 0.129878 hartree
zpe.sumelectzpe: -589.802339 hartree
zpe.sumelectthermal: -589.793342 hartree
zpe.sumelectthermalent: -589.792398 hartree
zpe.sumelectthermalfe: -589.836865 hartree
dipole: 3.0178 0.0000 -2.5201
dipole: 3.9317
quadrupole: -65.2181 -82.7892 -69.5757
quadrupole: -0.0001 -2.6617 -0.0001
quadrupole: 7.3095 -10.2615 2.9520 -0.0001 -2.6617 -0.0001
hfenergy: -589.9667435 hartree
pointgroup: C01 [X(C8H9N1O3)]
dipole: -1.171618 0.0001365 -1.0099895 debye
dipolederiv: -0.5788223 0.0000024 -0.0015023 -0.0000051 -0.5003749 0.0000037 0.0563066 0.0000023 -0.5328182 -0.6047478 0.2694436 -0.0459459 0.2030684 -1.1191165 0.0152523 -0.1032102 0.1012629 -0.3570167 -0.6047721 -0.2694607 -0.0460027 -0.2030734 -1.1190699 -0.0154101 -0.1032572 -0.1014155 -0.3570409 -0.5702288 -0.0000213 -0.0256753 -0.000012 -1.5615082 -0.0001311 -0.1177859 -0.0001306 -0.3052198 -0.4626761 0.0643458 -0.0052006 -0.017975 -0.0455043 0.0805795 -0.0186043 0.0270214 0.0270181 -0.4626824 -0.0643269 -0.0052144 0.0179966 -0.0454788 -0.0805936 -0.0185955 -0.0270345 0.0269953 0.5353981 0.0294049 -0.0241312 0.0638601 0.3144224 0.0137479 -0.1722366 0.0973894 0.3110439 0.5353943 -0.0294109 -0.024139 -0.0638312 0.314452 -0.0137459 -0.1722601 -0.0973812 0.3110205 -0.0814899 0.0579606 -0.091607 0.0615506 -0.0043548 0.0348933 -0.0130772 -0.0083837 0.0830722 -0.0814953 -0.0579361 -0.0916209 -0.0615432 -0.0043424 -0.0349094 -0.0130897 0.0083648 0.0830665 0.9595886 0.1492073 0.1741631 -0.0979226 1.7628584 0.012944 0.3408538 0.0544319 0.2558506 0.9595903 -0.149202 0.1741291 0.0978922 1.7628764 -0.0126364 0.3408717 -0.0541339 0.2558337 0.073261 -0.005643 -0.0269014 0.0114226 0.038541 -0.0629587 -0.0209938 -0.0744319 -0.0332101 0.0732599 0.0056479 -0.0268986 -0.0114192 0.0385112 0.0629754 -0.0209944 0.0744485 -0.03318 0.051673 0.0347659 -0.0119561 -0.0024029 -0.0388776 0.0449339 0.0036512 0.0738675 0.04324 0.0516711 -0.0347678 -0.0119658 0.0023976 -0.0388499 -0.0449519 0.003648 -0.0738858 0.0432134 -0.0915818 -0.0729166 0.064519 -0.0506532 0.0278052 0.0238101 0.0921054 0.0574397 0.0322781 0.082096 -0.001534 0.0070115 -0.013125 0.022993 -0.0714177 -0.0408811 -0.1101917 -0.1075457 0.0820965 0.0015298 0.0070142 0.0131317 0.0229509 0.0714473 -0.0408738 0.1102231 -0.1075042 -0.0915764 0.0729076 0.0645351 0.0506374 0.0278179 -0.0238143 0.0921149 -0.0574455 0.0322589 0.2260442 0.0000034 -0.0526108 0.0000058 0.144249 -0.0000183 -0.0736921 -0.0000173 0.3286443 unknown
polarizability: 98.9121476|-0.0002712|107.358509|5.0537316|0.0042258|66.2174368 unknown
InChI: InChI=1S/C8H9NO3/c10-7-5-3-1-2-4(12-3)6(5)8(11)9-7/h3-6,9H,1-2H2
charge 0 multiplicity 1
21 atoms
O  -1.02175 -0.000121 1.324761
O  1.812302 -2.347017 0.071511
O  1.812419 2.346926 0.072001
N  2.088137 -0.000061 0.157489
C  0.003975 -0.782359 -0.665676
C  0.004011 0.782511 -0.665505
C  -1.157566 -1.106719 0.330282
C  -1.157512 1.106705 0.33053
C  -2.51662 -0.786767 -0.353596
C  -2.516582 0.786972 -0.353418
C  1.377903 -1.188662 -0.116945
C  1.377961 1.188632 -0.116693
H  -0.152519 -1.252248 -1.65014
H  -0.152469 1.252621 -1.649866
H  -1.073633 -2.071536 0.846652
H  -1.073531 2.071403 0.847114
H  -3.347702 -1.183812 0.251317
H  -2.588924 -1.218905 -1.366612
H  -2.58887 1.219345 -1.366335
H  -3.347644 1.183918 0.251588
H  3.028713 -0.000127 0.560638
