program: Gaussian 09
title: 000239723
version: EM64L-G09RevD.01
frameworkgroup: C1[X(C14H12N2O5)]
method: RPBEPBE
basis: SDD
operation: Freq
keyword: #p
keyword: freq=noraman
keyword: PBEPBE/SDD
title: #p freq=noraman PBEPBE/SDD
converged: YES YES NO NO
title: Mulliken charges:
elementType: O O O O O N N C C C C C C C C C C C C C C H H H H H H H H H H H H
charge: -0.249896 -0.192696 -0.164624 -0.205261 -0.198042 0.010020 0.019875 0.365670 0.319947 0.343624 -0.561457 0.215641 -0.383630 -0.387853 0.288989 -0.807260 -0.802605 -0.266381 -0.476862 0.428469 -0.383675 0.270745 0.241823 0.268035 0.235695 0.230336 0.234512 0.228806 0.233898 0.232260 0.286244 0.332122 0.293530
chargesum: 0.00000
title: Mulliken charges with hydrogens summed into heavy atoms:
elementType: O O O O O N N C C C C C C C C C C C C C C
charge: -0.249896 -0.192696 -0.164624 -0.205261 -0.198042 0.010020 0.019875 0.365670 0.319947 0.343624 -0.290713 0.215641 -0.141807 -0.119817 0.288989 -0.106717 -0.107641 0.019863 -0.144739 0.428469 -0.090145
polarizability: 2.97080825e+02 2.33896903e+00 1.88408973e+02 -1.65717017e+01 -4.59589909e+00 1.27576465e+02
1716.lowfreq: -18.0104 -11.6990 -6.0119 -0.0013 -0.0010 -0.0009 2.0778 25.8281 37.2210
frequency: -15.6866 24.9735 37.2051 44.7712 57.7728 91.7508 101.2363 127.0570 141.3417 151.6606 154.1334 179.6844 215.4938 263.7532 289.2303 299.4566 307.7649 326.2062 347.3897 383.4463 422.4443 443.9159 458.0372 484.1099 501.4949 515.9966 544.0489 556.5618 604.2444 636.1182 653.7355 667.1488 702.4336 710.7238 720.0901 739.4943 747.1706 756.7393 794.7959 828.8205 842.2707 880.1574 888.5593 930.9298 951.9768 952.7750 990.0520 992.2165 999.5078 1030.1422 1052.3385 1054.0791 1111.0556 1114.4759 1144.3004 1146.1881 1188.0507 1203.0850 1217.3872 1235.8675 1251.3905 1258.0709 1274.9152 1358.1402 1370.8735 1374.2101 1393.7277 1398.9144 1401.0523 1407.2425 1430.8682 1459.3659 1464.3108 1468.9760 1472.6260 1476.8028 1489.2638 1582.3633 1592.7460 1607.0040 1615.8265 2973.1684 2975.1814 3045.4164 3049.8457 3088.7905 3091.6441 3137.6401 3142.9972 3170.8641 3175.4609 3188.2172 3189.9510
redmass: 3.9642 5.5279 8.5398 7.6334 14.6555 6.9846 1.0682 3.2642 11.3754 4.4780 1.1741 5.9855 3.4803 5.8754 2.7820 5.8624 7.0262 5.2542 8.9185 6.2633 4.3018 2.8419 3.6414 5.0718 5.9252 5.1074 4.8722 4.3724 6.4414 6.7388 7.1285 7.2057 5.1671 6.0801 3.6163 4.3276 4.7753 11.4132 6.0635 1.3711 1.4701 7.3638 1.4032 3.7811 1.4560 1.3535 1.3404 1.6326 1.4816 1.4552 1.6509 2.2320 2.1023 3.0097 1.4474 1.4676 2.7402 10.0544 7.1166 3.3863 1.9665 2.8274 1.3115 6.6352 6.1307 11.5098 1.2357 5.0790 3.5819 1.3093 6.6301 1.0469 2.8256 1.1869 1.0531 1.3404 1.8958 8.7435 7.3814 7.0515 6.6552 1.0376 1.0385 1.0968 1.0968 1.0986 1.0980 1.0899 1.0923 1.0888 1.0961 1.0932 1.0959
irintensity: 0.0572 0.5945 0.3605 0.2129 0.0649 3.9074 0.0251 0.9788 3.5111 1.4187 1.1780 1.2777 1.9111 1.4458 0.2478 0.4097 0.8963 1.1897 0.2924 0.6652 0.5238 6.0175 2.6024 5.2266 2.1405 2.3765 2.6984 3.5819 8.8184 8.0936 13.5933 12.3294 7.3339 9.0394 11.5352 0.7666 6.2943 18.9758 4.7910 24.9947 34.8959 13.0766 15.6455 59.6057 20.1241 6.6715 1.1668 10.6343 43.3748 15.3666 0.1873 48.2445 4.3439 6.7552 3.3781 123.8069 44.8050 351.1907 352.2299 168.9434 107.2306 68.3642 5.9493 85.5558 7.1682 73.1357 7.6466 48.6058 7.8810 30.8042 14.4878 0.0951 210.5896 23.8768 33.5992 10.4169 75.3778 42.9728 57.6282 144.6180 45.7446 50.1854 8.9200 34.0986 0.3388 31.9031 5.9418 18.9687 2.3169 0.5497 1.5668 12.9328 8.0488
temp: 298.150 k
press: 1.00000 atm
elementType: 8 8 8 8 8 7 7 6 6 6 6 6 6 6 6 6 6 6 6 6 6 1 1 1 1 1 1 1 1 1 1 1 1
symmnumber: 1
zpe: 624066.3 jmol-1
zpe.correction: 0.237694 hartree
zpe.thermalcorrener: 0.255993 hartree
zpe.thermalcorrenthalpy: 0.256937 hartree
zpe.thermalcorrgfe: 0.189569 hartree
zpe.sumelectzpe: -1024.635401 hartree
zpe.sumelectthermal: -1024.617103 hartree
zpe.sumelectthermalent: -1024.616159 hartree
zpe.sumelectthermalfe: -1024.683526 hartree
dipole: 8.6316 -3.3095 -0.6366
dipole: 9.2662
quadrupole: -128.5323 -142.0071 -115.3327
quadrupole: -10.7724 2.5679 -5.1942
quadrupole: 0.0917 -13.3830 13.2913 -10.7724 2.5679 -5.1942
hfenergy: -1024.8730954 hartree
pointgroup: C01 [X(C14H12N2O5)]
dipole: -3.2475435 1.6450337 0.1940833 debye
polarizability: 297.9714238|-9.272111|187.5916035|2.213414|10.4101889|127.5032358 unknown
InChI: InChI=1S/C14H12N2O5/c1-9-3-5-12(7-10(9)2)21-14-6-4-11(15(17)18)8-13(14)16(19)20/h3-8H,1-2H3
charge 0 multiplicity 1
33 atoms
O  -0.616514 -1.192926 -0.235918
O  2.739085 -3.350036 0.521822
O  0.835869 -3.424308 -0.737821
O  4.487941 2.651881 -0.427652
O  5.502709 0.611745 -0.264841
N  1.774904 -2.788035 -0.132053
N  4.455373 1.362648 -0.339376
C  -3.432172 0.838244 1.212465
C  -4.350594 0.814862 0.114931
C  -1.844901 -0.448276 -0.129649
C  -2.176846 0.197953 1.077366
C  0.595491 -0.531547 -0.286355
C  -3.982949 0.14426 -1.077713
C  -2.731214 -0.496682 -1.216623
C  1.795663 -1.306298 -0.211122
C  -3.795287 1.527793 2.514114
C  -5.707418 1.485159 0.226521
C  0.707694 0.88229 -0.39459
C  3.058564 -0.689994 -0.208238
C  3.129738 0.709324 -0.323034
C  1.963267 1.502979 -0.42318
H  -1.469916 0.1869 1.914268
H  -4.690236 0.117494 -1.914168
H  -2.452465 -1.030085 -2.129539
H  -2.979843 1.453623 3.2526
H  -4.014369 2.601155 2.35672
H  -4.702294 1.083283 2.96641
H  -5.6124 2.565582 0.447403
H  -6.282506 1.381053 -0.708493
H  -6.311011 1.046779 1.044317
H  -0.203595 1.48218 -0.459198
H  3.966906 -1.291534 -0.120327
H  2.061121 2.587431 -0.518546
