program: Gaussian 09
title: 000239717
version: EM64L-G09RevD.01
frameworkgroup: C1[X(C12H5Cl3N2O5)]
method: RPBEPBE
basis: SDD
operation: Freq
keyword: #p
keyword: freq=noraman
keyword: PBEPBE/SDD
title: #p freq=noraman PBEPBE/SDD
converged: YES YES NO NO
title: Mulliken charges:
elementType: Cl Cl Cl O O O O O N N C C C C C C C C C C C C H H H H H
charge: 0.025584 0.028200 0.031610 -0.239107 -0.183967 -0.162987 -0.197800 -0.191055 0.011796 0.021938 0.237681 0.294219 0.487034 -0.256046 -0.473192 0.432039 -0.381621 -0.323632 -0.316769 -0.066491 -0.173979 -0.106349 0.279231 0.334473 0.297265 0.300776 0.291152
chargesum: 0.00000
title: Mulliken charges with hydrogens summed into heavy atoms:
elementType: Cl Cl Cl O O O O O N N C C C C C C C C C C C C
charge: 0.025584 0.028200 0.031610 -0.239107 -0.183967 -0.162987 -0.197800 -0.191055 0.011796 0.021938 0.237681 0.294219 0.487034 0.023185 -0.138719 0.432039 -0.084356 -0.323632 -0.015993 -0.066491 0.117173 -0.106349
polarizability: 3.11775947e+02 -3.36419697e+00 1.72358486e+02 -2.11232601e+01 -4.10115883e+00 1.44182164e+02
1716.lowfreq: -5.1540 -2.0042 -0.0019 0.0021 0.0023 3.8755 14.8804 19.5699 34.5339
frequency: 14.8398 19.5347 34.5324 42.3478 55.4399 71.9869 89.9022 127.2921 140.8985 151.5302 167.2837 179.1191 202.9564 215.6454 242.0995 295.0999 303.0774 313.5668 327.9325 345.7534 384.4183 405.3116 435.0768 453.9928 487.0765 500.6242 514.9528 546.7340 575.6113 598.4833 636.3787 650.3731 653.0323 670.1330 686.0619 709.3697 718.0213 743.1344 757.0987 774.3487 841.0018 855.7795 869.8201 881.5158 905.2466 952.7105 989.0923 1034.5333 1054.5241 1105.3870 1112.9754 1145.7218 1186.4157 1203.8383 1215.9816 1227.3957 1239.9715 1255.8456 1325.5712 1358.4348 1362.9231 1377.0120 1405.5876 1426.5803 1437.0863 1465.6921 1558.4524 1574.4201 1593.2584 1609.1459 3167.2531 3181.6573 3183.6525 3187.6835 3189.9301
redmass: 18.1090 12.0781 14.4890 16.1234 15.4703 19.3919 8.3690 16.5698 10.3271 6.0494 12.3753 29.4781 9.9514 8.3510 11.5850 10.3990 10.6986 22.2791 12.2087 10.4057 10.7560 6.8514 4.3819 3.8305 6.1716 7.0013 5.3594 8.0168 7.8274 8.1640 8.0606 7.5238 7.6779 7.8244 5.1381 6.0512 6.2309 4.8302 12.4592 7.9791 1.4710 1.4655 8.4035 1.4471 8.0838 1.4750 1.3481 6.8622 2.2548 1.7373 4.4107 1.3094 5.1023 10.7142 7.9926 1.2524 3.6808 1.6259 9.0871 10.2863 6.8093 11.8750 9.6071 6.3819 3.1347 2.8486 10.6436 7.8480 9.0457 7.3734 1.0893 1.0928 1.0937 1.0926 1.0962
irintensity: 0.0970 1.1429 0.1745 0.4642 0.0355 0.2797 3.9916 0.8170 0.7083 1.4181 3.5128 0.0908 0.2427 0.2051 1.6106 0.8088 0.2994 0.1239 0.1233 1.0874 1.1884 3.4173 4.7660 14.8590 2.7768 1.8855 2.5341 19.6030 2.7475 15.4031 25.6390 11.2514 11.5242 10.8386 13.0115 15.5218 11.1261 5.5496 16.6989 19.1748 29.7753 3.3581 9.5792 30.8392 54.8722 26.0990 1.6809 107.4930 66.5420 89.4426 16.5251 41.5520 6.8474 315.8734 385.2149 13.3858 244.8015 4.8213 64.6732 11.6948 94.6626 68.7091 34.9594 32.4067 363.9150 115.9262 0.5489 26.3729 24.4812 168.6873 1.0819 5.1740 0.7111 17.9145 7.3185
temp: 298.150 k
press: 1.00000 atm
elementType: 17 17 17 8 8 8 8 8 7 7 6 6 6 6 6 6 6 6 6 6 6 6 1 1 1 1 1
symmnumber: 1
zpe: 405074.5 jmol-1
zpe.correction: 0.154285 hartree
zpe.thermalcorrener: 0.173984 hartree
zpe.thermalcorrenthalpy: 0.174928 hartree
zpe.thermalcorrgfe: 0.101779 hartree
zpe.sumelectzpe: -2324.328977 hartree
zpe.sumelectthermal: -2324.309279 hartree
zpe.sumelectthermalent: -2324.308334 hartree
zpe.sumelectthermalfe: -2324.381483 hartree
dipole: 5.0928 -2.5755 0.0786
dipole: 5.7076
quadrupole: -178.0105 -164.2233 -140.8811
quadrupole: -4.1589 3.2054 -3.4917
quadrupole: -16.9722 -3.1850 20.1572 -4.1589 3.2054 -3.4917
hfenergy: -2324.4832621 hartree
pointgroup: C01 [X(C12H5Cl3N2O5)]
dipole: 1.8727894 1.2264684 0.1756007 debye
polarizability: 300.6164644|19.7443675|174.6059318|42.2707503|-0.3216352|153.0942005 unknown
InChI: InChI=1S/C12H5Cl3N2O5/c13-7-4-9(15)12(5-8(7)14)22-11-2-1-6(16(18)19)3-10(11)17(20)21/h1-5H
charge 0 multiplicity 1
27 atoms
Cl 1.475436 0.0569 -2.697864
Cl 4.642385 0.536492 2.872362
Cl 5.927554 1.768988 0.105478
O  0.597854 -1.050714 0.053143
O  -2.661525 -3.291139 -0.868444
O  -0.842644 -3.282452 0.512963
O  -4.566655 2.709876 -0.268569
O  -5.533791 0.647211 -0.437386
N  -1.752486 -2.689357 -0.175466
N  -4.509625 1.420566 -0.311649
C  -0.63393 -0.403353 -0.012351
C  -1.805464 -1.204787 -0.150183
C  1.801642 -0.299599 0.059697
C  -0.767446 1.007347 0.033331
C  -3.074167 -0.611323 -0.266985
C  -3.172837 0.789451 -0.2083
C  -2.031472 1.608045 -0.055908
C  2.360128 0.216853 -1.132316
C  2.50762 -0.202931 1.273759
C  3.766758 0.428249 1.301676
C  3.617534 0.847503 -1.107076
C  4.319516 0.956033 0.112157
H  0.12617 1.628789 0.137066
H  -3.964459 -1.231453 -0.400247
H  -2.151853 2.693603 -0.015756
H  2.075258 -0.634949 2.179794
H  4.053502 1.24585 -2.026626
