program: Gaussian 09
title: 000239697
version: EM64L-G09RevD.01
frameworkgroup: C1[X(C13H11N3)]
method: RPBEPBE
basis: SDD
operation: Freq
keyword: #pfreq=noraman
keyword: PBEPBE/SDD
title: #p freq=noraman PBEPBE/SDD
converged: NO YES NO NO
title: Mulliken charges:
elementType: N N N C C C C C C C C C C C C C H H H H H H H H H H H
charge: -0.240730 -0.049183 -0.541630 0.310169 0.026378 0.028368 0.392376 -0.390477 -0.342526 -0.395312 -0.395378 -0.213075 -0.232539 -0.217484 -0.217445 -0.235034 0.233116 0.248680 0.241107 0.241289 0.222793 0.225464 0.308233 0.308174 0.227600 0.227616 0.229449
chargesum: 0.00000
title: Mulliken charges with hydrogens summed into heavy atoms:
elementType: N N N C C C C C C C C C C C C C
charge: -0.240730 -0.049183 0.074778 0.310169 0.026378 0.028368 0.392376 -0.157361 -0.093846 -0.154205 -0.154089 0.009718 -0.007075 0.010116 0.010171 -0.005585
polarizability: 2.43058213e+02 -5.89212940e+00 1.24150768e+02 2.53066174e-02 1.07670207e-01 1.07283721e+02
1716.lowfreq: -53.2757 -11.9046 -8.5063 -6.5913 -0.0006 0.0005 0.0007 52.8511 69.6668
frequency: -53.2628 52.8195 69.6628 138.0080 191.8276 239.1904 248.8251 266.0308 286.5600 297.5425 380.7630 397.5576 422.8183 449.2167 469.7824 537.2991 581.2866 582.1777 611.6183 614.0900 674.5093 701.5731 712.4181 729.2918 754.2469 770.6022 781.5053 821.7063 853.0871 858.0842 883.6192 929.7170 936.8707 976.4880 977.0587 989.4780 997.2196 1004.1184 1022.5149 1070.9402 1078.3065 1099.2005 1156.7014 1171.2571 1172.9950 1188.5815 1233.8428 1233.9693 1249.0043 1296.7418 1313.5353 1372.7750 1373.3523 1401.2616 1429.6184 1433.8161 1460.3478 1467.0750 1527.5027 1587.4753 1595.5258 1622.0744 1625.5798 1649.0315 3124.4368 3127.6780 3132.0316 3140.2213 3143.1805 3152.8546 3155.3886 3166.1828 3170.1121 3465.8755 3606.0055
redmass: 4.0236 5.1137 5.0089 3.6370 4.3868 3.8333 4.4305 3.2284 5.0942 1.2443 4.4689 2.8010 1.4135 3.4066 4.0233 5.6581 3.7494 6.3959 6.4536 5.2800 6.4924 1.7538 6.9483 3.6974 1.3790 3.6650 2.3994 5.8947 1.2461 1.4764 6.1489 1.5082 1.3804 1.3058 1.3905 5.9588 1.3345 2.0306 2.7490 3.3256 1.6001 2.0003 1.2020 2.3309 1.0530 1.1144 1.2049 3.8667 3.2944 1.8842 1.3465 7.4972 6.4067 4.1983 2.1996 3.2888 2.6313 3.1004 6.0328 6.0767 7.1191 7.0533 7.1117 1.1060 1.0845 1.0854 1.0879 1.0902 1.0927 1.0971 1.0953 1.1018 1.0992 1.0405 1.1057
irintensity: 0.5540 1.0118 1.7432 2.2769 0.0044 4.9652 0.1839 3.5247 3.3680 24.5223 1.2718 0.0261 216.9255 6.1915 27.8353 7.4103 0.4407 0.7803 0.1840 30.3948 0.0609 52.2425 0.7535 22.3284 96.1581 7.0756 33.5652 2.7881 0.0231 0.2475 5.0323 2.3388 3.0455 0.0614 0.0100 1.9475 0.1886 4.9154 19.8555 5.3812 8.6371 0.8945 4.4813 3.1029 0.0018 3.1482 0.1365 33.9595 29.8498 18.8635 0.3607 0.1324 8.6476 8.0140 8.4878 66.8983 39.4534 5.2934 22.8233 1.0031 2.1157 0.3316 2.2990 25.0955 0.7997 0.0723 0.8675 10.6716 21.4847 36.3008 26.8638 24.3965 23.6658 1.7084 11.0717
temp: 298.150 k
press: 1.00000 atm
elementType: 7 7 7 6 6 6 6 6 6 6 6 6 6 6 6 6 1 1 1 1 1 1 1 1 1 1 1
symmnumber: 1
zpe: 552708.6 jmol-1
zpe.correction: 0.210516 hartree
zpe.thermalcorrener: 0.222384 hartree
zpe.thermalcorrenthalpy: 0.223328 hartree
zpe.thermalcorrgfe: 0.172434 hartree
zpe.sumelectzpe: -665.111347 hartree
zpe.sumelectthermal: -665.099479 hartree
zpe.sumelectthermalent: -665.098535 hartree
zpe.sumelectthermalfe: -665.149429 hartree
dipole: -0.0375 4.1460 -0.0133
dipole: 4.1462
quadrupole: -79.9703 -88.6337 -88.1657
quadrupole: 2.1746 -0.0051 0.0371
quadrupole: 5.6196 -3.0438 -2.5758 2.1746 -0.0051 0.0371
hfenergy: -665.321863 hartree
pointgroup: C01 [X(C13H11N3)]
dipole: 0.0091402 1.6311959 -0.0022516 debye
polarizability: 243.0161974|6.3017459|124.1914372|-0.0057173|-0.1854216|107.2850674 unknown
InChI: InChI=1S/C13H11N3/c14-16-12-9-5-4-8-11(12)15-13(16)10-6-2-1-3-7-10/h1-9H,14H2
charge 0 multiplicity 1
27 atoms
N  -0.535236 0.969043 -0.001055
N  -0.501094 -1.318837 0.002671
N  -0.030668 2.273859 -0.002843
C  -1.888013 0.569443 -0.000545
C  0.256391 -0.209371 0.000544
C  -1.844589 -0.862731 0.001816
C  1.741759 -0.161475 0.000411
C  -3.092194 1.299083 -0.001758
C  -3.049266 -1.600582 0.002963
C  2.457664 -0.144085 -1.222261
C  2.457884 -0.149874 1.223014
C  -4.285865 0.543252 -0.000572
C  -4.264348 -0.88249 0.001745
C  3.869857 -0.11087 -1.222576
C  3.870084 -0.116626 1.223223
C  4.579559 -0.094533 0.000305
H  -3.111561 2.394331 -0.003508
H  -3.026857 -2.69469 0.00476
H  1.908367 -0.168617 -2.16994
H  1.908717 -0.178933 2.170636
H  -5.250232 1.063509 -0.001427
H  -5.213615 -1.429211 0.002615
H  -0.186699 2.79159 0.865067
H  -0.186857 2.789231 -0.872121
H  4.413891 -0.102439 -2.173578
H  4.414289 -0.112663 2.174155
H  5.675136 -0.070812 0.00026
