program: Gaussian 09
title: 000239693
version: EM64L-G09RevD.01
frameworkgroup: C1[X(C13H13N3O)]
method: RPBEPBE
basis: SDD
operation: Freq
keyword: #p
keyword: freq=noraman
keyword: PBEPBE/SDD
title: #p freq=noraman PBEPBE/SDD
converged: YES YES NO NO
title: Mulliken charges:
elementType: O N N N C C C C C C C C C C C C C H H H H H H H H H H H H H
charge: -0.332742 -0.376125 -0.390832 -0.707439 0.272974 0.286770 0.289397 -0.356437 -0.377986 0.173397 -0.265753 -0.210608 -0.350749 -0.355395 -0.218226 -0.230592 -0.224632 0.300438 0.236800 0.212878 0.322551 0.223321 0.219748 0.274098 0.229584 0.234458 0.232800 0.234802 0.291053 0.362447
chargesum: 0.00000
title: Mulliken charges with hydrogens summed into heavy atoms:
elementType: O N N N C C C C C C C C C C C C C
charge: -0.332742 -0.075687 -0.068282 -0.053940 0.272974 0.286770 0.289397 -0.119637 -0.165108 0.173397 -0.042431 0.009140 -0.076651 -0.125811 0.016232 0.002208 0.010170
polarizability: 2.32538658e+02 -1.22648738e+01 1.71889913e+02 -4.88910739e+00 -4.87126481e+00 9.43994828e+01
1716.lowfreq: -13.4641 -7.2768 -0.0005 0.0005 0.0005 2.7250 22.1078 34.8467 40.0519
frequency: 21.9695 34.8102 39.9543 106.7124 122.7167 150.4660 178.6221 238.8939 252.2832 277.8843 333.3129 378.7642 402.0973 422.9679 423.7084 450.0997 475.3211 498.7214 523.4798 541.4846 569.9377 585.1118 614.3851 647.5319 667.5709 686.0013 701.8933 725.7765 747.5179 766.1356 789.0116 807.5378 838.2214 843.7829 856.9278 877.8615 933.0149 937.6553 964.1450 985.1399 989.9746 1005.9654 1020.3713 1025.2064 1040.1247 1062.5242 1086.2660 1130.5338 1150.6371 1169.5743 1174.7572 1190.9766 1201.9009 1271.8954 1287.2359 1317.9443 1325.7632 1382.4671 1384.9606 1422.3738 1438.4766 1450.2219 1482.4563 1487.3915 1501.8626 1553.2829 1577.4137 1595.8708 1611.5096 1625.5077 1670.0478 3113.4594 3123.5229 3131.2488 3134.4801 3140.4950 3147.7404 3160.6962 3165.3398 3171.8127 3310.0763 3423.7780 3559.5535 3623.3293
redmass: 4.5482 5.3466 4.5800 6.1525 4.6071 4.9207 4.9620 4.7764 6.3396 4.8824 2.9842 4.8584 2.8269 3.9976 2.5553 1.4740 2.4526 3.5013 2.4757 1.7653 4.7039 3.3091 6.3063 3.0227 4.1885 4.6544 1.5800 3.3089 1.3852 1.2574 2.2620 2.8836 3.8528 1.7485 1.2518 4.3570 1.4040 1.4297 1.3068 1.4590 5.0060 1.3402 2.9276 2.1296 2.4343 2.0685 1.6234 1.4371 2.5734 1.0639 1.0594 1.1373 3.1067 1.7881 2.1792 1.3500 1.9487 5.1564 8.4540 1.9301 2.0321 2.3188 1.9864 2.2228 2.0955 5.5216 5.8262 6.1934 5.9870 5.5370 1.1734 1.0865 1.0872 1.0878 1.0874 1.0944 1.0923 1.0959 1.1002 1.1007 1.0649 1.0733 1.0791 1.0870
irintensity: 1.4646 0.2500 1.3423 5.0909 1.4594 6.7189 1.3147 1.6920 10.0846 12.5402 15.6745 2.8916 0.0001 1.6310 8.6045 90.6473 27.2223 24.2403 19.3556 93.3706 41.9978 22.4555 0.3166 110.5936 21.1041 29.1006 79.3143 15.2727 172.1018 59.7520 33.4737 4.5519 14.2390 0.8175 1.4882 4.2578 1.5709 2.9939 0.3414 1.4384 0.2602 0.6911 16.7458 6.6275 6.5100 3.8563 14.7794 15.1995 2.6029 7.2932 0.8150 10.7687 21.2854 10.1214 78.2406 0.9115 24.5401 13.0711 3.0139 86.5088 59.4095 48.2009 5.2565 12.3966 135.3277 117.7117 3.5314 10.2410 6.7823 58.4596 101.8307 11.2383 6.6616 1.6322 1.6590 39.6348 19.9957 15.7366 26.7492 20.8667 508.8379 9.4534 32.4371 48.6606
temp: 298.150 k
press: 1.00000 atm
elementType: 8 7 7 7 6 6 6 6 6 6 6 6 6 6 6 6 6 1 1 1 1 1 1 1 1 1 1 1 1 1
symmnumber: 1
zpe: 623616.0 jmol-1
zpe.correction: 0.237523 hartree
zpe.thermalcorrener: 0.252110 hartree
zpe.thermalcorrenthalpy: 0.253054 hartree
zpe.thermalcorrgfe: 0.194348 hartree
zpe.sumelectzpe: -741.450041 hartree
zpe.sumelectthermal: -741.435454 hartree
zpe.sumelectthermalent: -741.434510 hartree
zpe.sumelectthermalfe: -741.493216 hartree
dipole: -2.7576 -1.4202 -0.5839
dipole: 3.1563
quadrupole: -86.9668 -89.9706 -102.0886
quadrupole: 4.9089 -3.5565 -2.8863
quadrupole: 6.0419 3.0380 -9.0799 4.9089 -3.5565 -2.8863
hfenergy: -741.6875642 hartree
pointgroup: C01 [X(C13H13N3O1)]
dipole: -1.1320717 -0.4876874 -0.1503952 debye
polarizability: 229.611442|-18.3227617|169.8358832|0.2518254|-20.1743217|99.3807277 unknown
InChI: InChI=1S/C13H13N3O/c14-11-8-4-5-9-12(11)15-16-13(17)10-6-2-1-3-7-10/h1-9,15-16H,14H2
charge 0 multiplicity 1
30 atoms
O  -0.423128 1.893244 0.015832
N  1.195609 0.209093 1.58576
N  -0.12852 -0.110134 1.147482
N  2.396513 1.775523 -0.543427
C  2.302284 -0.295196 0.786016
C  2.903729 0.51424 -0.238608
C  -2.299195 0.338182 0.08439
C  2.826341 -1.571053 1.084214
C  4.055727 -0.003133 -0.905581
C  -0.891983 0.761588 0.39131
C  3.942251 -2.086092 0.389218
C  4.560065 -1.281335 -0.599691
C  -3.23795 1.352367 -0.233417
C  -2.706742 -1.022307 0.065703
C  -4.572168 1.014825 -0.541159
C  -4.041964 -1.35771 -0.246049
C  -4.979022 -0.340484 -0.54323
H  1.249895 1.223262 1.763171
H  2.359022 -2.142141 1.894624
H  4.537092 0.604482 -1.682377
H  -0.545099 -0.927169 1.594311
H  4.336534 -3.07865 0.628765
H  5.439655 -1.653809 -1.137653
H  -2.896192 2.392324 -0.239279
H  -1.984059 -1.826793 0.248047
H  -5.29299 1.803793 -0.781333
H  -4.348323 -2.409065 -0.269263
H  -6.014748 -0.603224 -0.78512
H  2.858271 2.318826 -1.269621
H  1.412492 2.00374 -0.326937
