program: Gaussian 09
title: 000239692
version: EM64L-G09RevD.01
frameworkgroup: C1[X(C5H4N2O3)]
method: RPBEPBE
basis: SDD
operation: Freq
keyword: #pfreq=noraman
keyword: PBEPBE/SDD
title: #p freq=noraman PBEPBE/SDD
converged: NO YES NO YES
title: Mulliken charges:
elementType: O O O N N C C C C C H H H H
charge: -0.466331 -0.208491 -0.195695 -0.371324 0.014239 0.287125 -0.335196 0.049903 -0.235620 0.158075 0.287706 0.362451 0.247159 0.406000
chargesum: 0.00000
title: Mulliken charges with hydrogens summed into heavy atoms:
elementType: O O O N N C C C C C
charge: -0.060330 -0.208491 -0.195695 -0.008873 0.014239 0.287125 -0.047491 0.049903 0.011539 0.158075
polarizability: 1.10356543e+02 -1.13059201e+01 8.75702253e+01 -2.89386599e-03 8.32672794e-03 3.15859322e+01
1716.lowfreq: 0.0012 0.0012 0.0014 6.2818 9.3479 12.4574 66.9330 123.7603 144.9118
frequency: 66.9309 123.7517 144.9116 177.5170 348.1627 412.0143 426.9656 488.3478 521.7984 545.6995 592.7143 612.1227 705.2529 731.5054 736.4732 740.6481 810.9934 916.8941 926.9176 961.3200 1013.9201 1086.1898 1120.8376 1181.2369 1270.9763 1352.4615 1369.0948 1441.2501 1552.3076 1587.3650 1628.1077 1675.2166 3130.1548 3191.9896 3534.5245 3549.9261
redmass: 9.6667 5.7789 7.2331 7.8463 8.3753 11.1836 3.1627 3.0873 7.0759 9.0566 4.8380 1.3807 1.2231 6.7023 3.2333 9.1862 5.5832 1.4054 1.5667 6.7985 3.4367 3.5400 2.2806 1.6747 1.9922 1.9393 1.3348 5.6288 3.8165 9.2539 7.7324 9.7231 1.0933 1.0935 1.0791 1.0650
irintensity: 0.0024 0.0624 1.7534 3.5837 5.9503 6.4181 25.4481 16.7435 5.6476 2.6485 41.1284 137.9819 122.8335 3.1739 19.9269 12.7270 5.8630 0.0356 33.5607 145.3988 96.2619 59.7454 125.5888 13.7162 27.7087 87.9827 6.6400 157.7340 273.2104 93.2113 114.9420 179.3690 18.0807 2.1885 115.6970 76.0393
temp: 298.150 k
press: 1.00000 atm
elementType: 8 8 8 7 7 6 6 6 6 6 1 1 1 1
symmnumber: 1
zpe: 243299.5 jmol-1
zpe.correction: 0.092668 hartree
zpe.thermalcorrener: 0.100912 hartree
zpe.thermalcorrenthalpy: 0.101856 hartree
zpe.thermalcorrgfe: 0.058904 hartree
zpe.sumelectzpe: -527.384324 hartree
zpe.sumelectthermal: -527.376080 hartree
zpe.sumelectthermalent: -527.375136 hartree
zpe.sumelectthermalfe: -527.418088 hartree
dipole: -6.8332 4.7529 0.0015
dipole: 8.3236
quadrupole: -68.3451 -55.0488 -56.6606
quadrupole: -1.2660 0.0041 -0.0013
quadrupole: -8.3269 4.9694 3.3575 -1.2660 0.0041 -0.0013
hfenergy: -527.4769922 hartree
pointgroup: C01 [X(C5H4N2O3)]
dipole: 2.6250741 -1.9578088 0.0005986 debye
dipolederiv: -0.8284501 0.5037404 -0.000033 0.5198841 -0.9099136 0.0000003 -0.0000187 -0.0000667 -0.4479642 -0.8378994 0.3694421 0.0000963 0.33612 -0.7409827 -0.0000631 -0.0001647 0.0002938 -0.3613514 -0.8160143 -0.2159414 0.0000271 -0.2353965 -0.7811327 -0.0000041 0.0000728 0.0001089 -0.3004944 -0.8464144 -0.1033071 -0.0000235 0.1145608 -0.745671 0.0000525 -0.0002109 0.0001142 -0.1888097 -0.4793049 0.0971086 0.0000428 0.406132 -0.8884536 0.0001182 -0.0000016 0.0000167 -0.2727695 -0.4644184 0.0817321 -0.0000362 -0.0768296 0.6705209 -0.0000683 0.0001694 -0.0001625 0.047633 -0.3948124 0.2609343 -0.0000848 -0.1996514 -0.1017015 -0.0000501 -0.0000488 0.0000302 -0.0839717 1.0981974 -0.4734955 -0.0000378 -0.3752488 1.0777783 -0.0000214 -0.000093 -0.0002441 0.241459 1.0259376 -0.1236407 0.0001059 -0.1432772 0.5535839 0.0000168 0.0001974 -0.0000709 0.0268473 1.8209478 -0.2475389 -0.0000629 -0.0978636 1.3643261 -0.0000143 -0.0000185 -0.0000613 0.2712801 0.0836518 -0.0477403 0.000003 -0.0554544 0.0592216 0.0000153 0.0000667 0.0000433 0.1610446 0.2910649 -0.0182287 -0.0000064 -0.0374392 0.268368 -0.0000081 -0.0000039 -0.0000119 0.3524768 0.0907924 0.0246949 -0.0000245 -0.0000097 -0.1027963 0.0000036 0.0000233 -0.0000152 0.1316381 0.2567218 -0.1077597 0.0000341 -0.1555266 0.2768525 0.0000229 0.0000307 0.0000255 0.4229818 unknown
polarizability: 109.5841915|-12.0343815|88.3425764|0.0026169|-0.0084179|31.5859322 unknown
InChI: InChI=1S/C5H4N2O3/c8-4-1-3(5(9)10)6-2-7-4/h1-2,6,9H
charge 0 multiplicity 1
14 atoms
O  2.801251 -0.869595 -0.000036
O  -2.747575 1.45618 -0.000528
O  2.544352 1.45394 -0.000222
N  0.216977 -1.359435 0.000308
N  -2.126578 -0.822786 0.000105
C  0.586477 -0.011295 0.000148
C  -0.39024 0.962001 0.000038
C  -1.825341 0.59475 0.000346
C  -1.135136 -1.690154 0.000193
C  2.039478 0.314669 0.000041
H  -0.110279 2.018354 -0.000191
H  0.951549 -2.071876 0.000364
H  -1.35812 -2.764197 0.000152
H  3.771483 -0.655456 -0.000216
