program: Gaussian 09
title: 000239679
version: EM64L-G09RevD.01
frameworkgroup: C1[X(C12H11ClN2O2)]
method: RPBEPBE
basis: SDD
operation: Freq
keyword: #p
keyword: freq=noraman
keyword: PBEPBE/SDD
title: #p freq=noraman PBEPBE/SDD
converged: YES YES NO NO
title: Mulliken charges:
elementType: Cl O O N N C C C C C C C C C C C C H H H H H H H H H H H
charge: -0.086098 -0.223080 -0.296378 -0.411675 -0.482070 -0.460717 0.356786 0.586508 0.300584 -0.415040 -0.350707 -0.318684 -0.253256 -0.223866 -0.221426 -0.169571 -0.246672 0.277471 0.239078 0.295670 0.295246 0.260547 0.314634 0.254306 0.253171 0.230533 0.260765 0.233939
chargesum: 0.00000
title: Mulliken charges with hydrogens summed into heavy atoms:
elementType: Cl O O N N C C C C C C C C C C C C
charge: -0.086098 -0.223080 -0.296378 -0.116004 -0.186824 0.055832 0.356786 0.586508 0.300584 -0.154493 -0.350707 -0.004050 0.001050 0.029305 0.009107 0.091194 -0.012733
polarizability: 2.35538773e+02 -2.01634101e+01 1.48480718e+02 1.76200957e+01 -5.03890828e+00 1.01143826e+02
1716.lowfreq: -8.7074 0.0001 0.0013 0.0027 0.1211 3.9154 14.8946 26.8511 39.9245
frequency: 14.8703 26.8236 39.9171 59.2500 81.3902 112.3314 150.3808 177.1129 195.5092 246.0460 264.5388 282.3831 313.8672 362.4393 399.3094 414.5818 437.5705 457.8682 538.7735 586.6308 594.8612 632.8826 639.8600 669.5031 689.8732 707.2040 716.8314 733.0100 757.2794 762.0081 820.5624 835.5020 866.9536 869.8169 875.6073 878.9227 935.6992 945.0014 993.0453 997.0722 1003.6734 1023.8452 1037.0253 1048.4936 1098.1696 1127.5068 1134.0733 1170.3808 1186.2598 1213.1729 1223.0456 1245.6288 1257.5703 1311.1942 1342.5401 1366.6552 1371.3500 1427.8171 1457.8772 1466.6237 1483.7844 1489.8957 1519.0458 1576.9987 1588.8017 1613.7134 1646.7749 2990.1654 3050.7577 3140.7313 3157.9954 3176.1652 3189.2477 3217.2356 3232.7801 3268.4643 3484.1829 3550.8385
redmass: 5.7486 6.2799 4.9058 6.6686 5.7089 5.7953 4.9951 3.8586 8.0310 6.4531 3.8704 5.5375 2.8743 5.7388 1.9138 4.6037 3.4384 3.2302 3.2713 5.7424 3.1284 4.7127 1.2276 6.2564 5.9939 9.8368 4.2349 1.2683 1.2465 4.3117 1.3286 5.1214 4.7639 1.3488 2.2196 2.0240 2.7405 1.3534 1.3084 2.9670 5.3823 1.6770 2.1005 3.2361 4.1466 1.5663 1.5611 1.0642 1.7777 1.8650 2.1197 1.6213 1.3967 1.9222 1.4691 2.4812 4.0725 2.6688 2.3019 1.0857 2.2678 3.4803 2.5660 5.1989 6.7252 7.0602 4.1107 1.0619 1.0991 1.0866 1.0917 1.0979 1.0958 1.0931 1.0980 1.1084 1.0760 1.0778
irintensity: 0.5277 0.0291 0.7169 6.7889 6.5764 2.8762 0.1764 1.0722 3.1147 11.5834 1.9361 9.2525 5.5249 14.9441 23.5537 5.6309 18.4089 27.2356 21.2473 4.6965 6.2965 6.1038 126.3722 15.1257 6.0228 13.5020 3.6568 88.5188 106.0813 19.5055 32.8588 3.3764 9.1547 5.0666 3.6128 5.7354 3.9213 5.8623 3.4678 6.2453 55.1113 28.9734 14.7186 0.2211 3.5870 1.3442 18.0482 0.3072 30.6035 313.5272 37.6959 13.1865 78.4760 52.2148 2.4730 42.6025 101.0405 61.5871 87.0154 21.5368 233.8399 103.1396 676.4951 16.6266 7.5336 111.0013 168.0360 53.0964 7.4628 5.1636 12.4728 8.1683 15.4291 4.6296 0.3838 0.4401 41.4003 26.1982
temp: 298.150 k
press: 1.00000 atm
elementType: 17 8 8 7 7 6 6 6 6 6 6 6 6 6 6 6 6 1 1 1 1 1 1 1 1 1 1 1
symmnumber: 1
zpe: 550124.1 jmol-1
zpe.correction: 0.209531 hartree
zpe.thermalcorrener: 0.224887 hartree
zpe.thermalcorrenthalpy: 0.225831 hartree
zpe.thermalcorrgfe: 0.163512 hartree
zpe.sumelectzpe: -1182.668654 hartree
zpe.sumelectthermal: -1182.653298 hartree
zpe.sumelectthermalent: -1182.652354 hartree
zpe.sumelectthermalfe: -1182.714673 hartree
dipole: -1.7754 2.4093 -0.8018
dipole: 3.0983
quadrupole: -82.9373 -109.3341 -103.2759
quadrupole: -8.6954 4.9064 -1.2097
quadrupole: 15.5784 -10.8183 -4.7601 -8.6954 4.9064 -1.2097
hfenergy: -1182.878185 hartree
pointgroup: C01 [X(C12H11Cl1N2O2)]
dipole: 0.6681519 -0.9740333 0.3011992 debye
polarizability: 233.6909593|-29.8677075|138.6984461|-3.386394|-20.8108133|112.7739115 unknown
InChI: InChI=1S/C12H11ClN2O2/c13-10-5-1-2-6-11(10)15-12(16)14-8-9-4-3-7-17-9/h1-7,14-15H,8H2
charge 0 multiplicity 1
28 atoms
Cl -2.917715 -2.239508 1.471044
O  3.540316 0.530685 0.940292
O  0.034827 1.22886 -1.355393
N  1.188258 -0.668791 -0.630686
N  -1.071767 -0.434845 -0.083451
C  2.474364 -0.209933 -1.183195
C  3.603205 -0.300442 -0.202135
C  -2.380173 0.090799 -0.021445
C  0.044893 0.124175 -0.733144
C  4.77741 -1.038099 -0.163547
C  -3.381681 -0.63923 0.678087
C  -2.7733 1.322467 -0.61873
C  5.486402 -0.662852 1.0442
C  -4.708038 -0.199218 0.795038
C  -4.10416 1.773664 -0.508214
C  4.707151 0.283723 1.685474
C  -5.077489 1.025793 0.192798
H  2.302922 0.831354 -1.513484
H  2.752155 -0.800005 -2.077906
H  1.176651 -1.551771 -0.118112
H  -0.94952 -1.322158 0.414352
H  5.100562 -1.761459 -0.910238
H  -2.015558 1.896593 -1.155209
H  6.44534 -1.046761 1.386123
H  -5.436524 -0.801783 1.345079
H  -4.37994 2.724559 -0.976516
H  4.805378 0.85184 2.606117
H  -6.108868 1.382241 0.275602
