program: Gaussian 09
title: 000239661
version: EM64L-G09RevD.01
frameworkgroup: C1[X(C18H28O4)]
method: RPBEPBE
basis: SDD
operation: Freq
keyword: #pfreq=noraman
keyword: PBEPBE/SDD
title: #p freq=noraman PBEPBE/SDD
converged: YES YES NO NO
title: Mulliken charges:
elementType: O O O O C C C C C C C C C C C C C C C C C C H H H H H H H H H H H H H H H H H H H H H H H H H H H H
charge: -0.261026 -0.280086 -0.245374 -0.234362 -0.228587 -0.212884 -0.270197 -0.246047 -0.461495 -0.480537 -0.221373 -0.217307 0.216221 0.195284 -0.308043 -0.236520 -0.060612 -0.081481 -0.699798 -0.680849 -0.688000 -0.698258 0.246859 0.257668 0.297340 0.289256 0.238024 0.219873 0.228610 0.226614 0.229745 0.236135 0.230931 0.215666 0.223443 0.217636 0.239352 0.213608 0.204288 0.222063 0.220687 0.199590 0.209650 0.235341 0.243739 0.202402 0.206983 0.209196 0.215224 0.221409
chargesum: 0.00000
title: Mulliken charges with hydrogens summed into heavy atoms:
elementType: O O O O C C C C C C C C C C C C C C C C C C
charge: -0.261026 -0.280086 -0.245374 -0.234362 0.018272 0.044784 0.027144 0.043209 -0.003599 -0.025314 0.008372 0.018828 0.216221 0.195284 0.138554 0.204559 0.178740 0.132127 -0.052760 -0.036269 -0.034877 -0.052429
polarizability: 2.26071569e+02 -8.16445427e+00 2.03467872e+02 1.89628499e+00 1.10375152e-01 1.66403991e+02
1716.lowfreq: -5.5228 -0.0004 0.0007 0.0007 6.6299 9.2488 19.0745 23.8337 31.8477
frequency: 16.3766 23.6652 31.7121 43.5845 47.4223 49.9327 57.5875 68.8503 76.7648 119.1916 131.1256 158.1474 182.7064 199.5155 207.6900 216.1442 225.2162 234.2166 240.2467 248.8415 259.4728 277.8383 307.2334 327.9333 344.2997 366.9851 376.1653 392.3427 414.7854 417.0684 437.1361 483.2333 511.3169 543.9664 603.3449 640.6148 645.8863 658.9788 704.9317 710.1120 741.2326 806.3035 816.8245 822.1209 826.5272 842.6597 852.9394 889.0996 895.7080 899.3133 914.9259 918.2492 922.7072 926.0146 943.2515 949.4886 959.1335 962.3377 967.3589 967.6266 970.6070 988.7789 1003.7638 1022.2634 1055.7894 1063.5891 1085.2885 1124.2576 1129.3798 1134.4247 1134.9000 1148.2937 1152.3449 1161.8867 1171.9556 1178.2576 1186.7771 1188.8888 1215.1449 1221.9460 1229.3336 1236.6976 1258.0108 1276.1903 1276.9578 1288.8653 1296.0470 1305.7613 1306.8570 1316.1902 1339.0806 1342.2285 1344.9180 1351.9264 1360.4855 1362.0208 1364.2679 1377.1368 1379.1007 1397.3749 1397.6193 1443.1102 1462.6806 1467.7712 1469.3628 1469.6750 1470.8580 1475.3282 1481.2801 1482.8333 1483.4090 1487.8291 1490.0967 1624.2535 1626.3618 1631.1238 2959.5403 2970.8889 2972.5014 2973.4781 2974.9713 2984.6335 2993.9572 2995.5369 2997.8634 3009.7865 3016.6360 3048.5828 3050.2472 3059.8453 3060.5398 3061.7519 3063.2822 3068.7536 3070.9804 3072.5133 3073.4410 3077.6394 3078.6069 3083.8195 3087.0382 3094.3716 3133.0372 3166.4828
redmass: 3.4324 3.6643 3.5718 6.6984 3.0798 2.9598 3.6943 5.2072 3.7924 3.6965 4.1858 3.4602 2.5206 1.3354 1.0718 2.4955 1.2623 1.1719 2.3161 3.6330 2.5667 3.4641 3.3765 3.7170 2.7375 2.7180 3.3067 2.5826 1.9371 2.0180 3.7759 4.0156 4.3579 5.3078 5.3990 5.0830 4.8343 3.9239 2.4525 3.3389 4.0345 2.0129 2.6224 2.1191 3.7043 2.9959 3.4885 2.6222 1.7424 2.5876 1.6752 1.5654 1.3969 1.4850 1.7062 1.5859 1.9562 2.2629 1.6629 1.6868 2.3726 3.1249 4.2940 2.2143 2.3799 4.3826 1.6800 1.1798 2.4941 2.2478 2.1298 3.0587 1.7368 1.9088 1.1835 1.2361 1.8148 1.7433 1.2932 1.4637 1.2615 1.2014 1.2206 1.3582 1.5364 1.4136 1.3872 1.2788 1.3514 1.3721 1.4329 1.4332 1.4785 1.4854 1.5169 1.7870 1.5126 1.2121 1.2134 1.2139 1.2183 1.0995 1.0637 1.0462 1.0508 1.0777 1.0496 1.0680 1.0488 1.0476 1.0917 1.0571 1.0568 8.4100 7.6023 8.8338 1.0808 1.0359 1.0358 1.0368 1.0369 1.0818 1.0597 1.0582 1.0829 1.0621 1.0573 1.0977 1.0913 1.1054 1.0861 1.0994 1.0993 1.0993 1.0900 1.1009 1.1015 1.0994 1.0990 1.0993 1.0994 1.1080 1.0869 1.1050
irintensity: 0.1590 0.2127 0.3034 1.1563 0.6277 0.0827 0.8612 0.6240 1.0731 1.0293 1.8216 0.8395 0.2336 0.1396 0.0833 1.9137 0.6253 0.3263 3.0197 3.8248 0.2165 13.6770 11.5092 0.7131 3.0121 1.3487 1.7711 1.6112 4.6955 2.0379 4.4630 0.8143 1.7774 2.5009 5.3854 1.0547 1.3347 13.5195 22.9003 22.2180 14.4003 9.8038 7.9727 5.8895 4.4483 3.5250 22.1541 7.8134 3.6323 22.2900 0.5515 1.9140 14.4794 18.3455 1.8767 4.1302 1.5505 3.6224 1.5947 4.7169 32.0754 74.3872 69.2713 37.6143 11.8213 25.3973 13.1901 24.7436 225.7470 16.8309 53.2644 307.2069 6.4719 0.9883 11.7891 10.0215 4.7103 5.8522 12.1186 63.3834 0.9896 1.1014 4.1084 27.9547 13.9517 9.9602 3.4442 1.4064 2.4407 12.7852 1.0823 3.0731 0.8375 10.1382 2.6640 8.7827 22.1055 29.7009 10.7547 8.7770 18.6598 9.8933 3.5441 7.0750 5.4639 2.0701 6.5673 4.4790 22.3928 4.0145 14.3144 24.0053 22.2810 117.4712 52.7201 134.3790 14.9645 33.7458 31.4983 29.9884 24.2780 9.0778 28.7558 34.5824 4.3185 45.5354 43.4810 7.3012 18.2574 9.6334 11.4045 13.8501 11.0387 69.2167 16.8737 73.4367 49.4878 37.9664 43.9012 34.6800 40.9613 28.0952 7.3709 29.4622
temp: 298.150 k
press: 1.00000 atm
elementType: 8 8 8 8 6 6 6 6 6 6 6 6 6 6 6 6 6 6 6 6 6 6 1 1 1 1 1 1 1 1 1 1 1 1 1 1 1 1 1 1 1 1 1 1 1 1 1 1 1 1
symmnumber: 1
zpe: 1122926.9 jmol-1
zpe.correction: 0.427700 hartree
zpe.thermalcorrener: 0.451681 hartree
zpe.thermalcorrenthalpy: 0.452626 hartree
zpe.thermalcorrgfe: 0.371573 hartree
zpe.sumelectzpe: -1001.884133 hartree
zpe.sumelectthermal: -1001.860152 hartree
zpe.sumelectthermalent: -1001.859208 hartree
zpe.sumelectthermalfe: -1001.940261 hartree
dipole: 2.1526 -1.5125 1.4132
dipole: 2.9864
quadrupole: -124.9220 -132.1873 -135.0418
quadrupole: 5.6225 -0.3568 -1.4897
quadrupole: 5.7951 -1.4703 -4.3247 5.6225 -0.3568 -1.4897
hfenergy: -1002.3118336 hartree
pointgroup: C01 [X(C18H28O4)]
dipole: 0.811552 0.639093 -0.5598193 debye
polarizability: 225.0871164|9.3629478|204.4455023|-2.0293295|-0.1615196|166.4108139 unknown
InChI: InChI=1S/C18H28O4/c1-11(2)9-21-17(19)15-13-5-7-14(8-6-13)16(15)18(20)22-10-12(3)4/h5,7,11-16H,6,8-10H2,1-4H3
charge 0 multiplicity 1
50 atoms
O  0.529729 2.1167 -0.728254
O  0.55243 -1.783107 0.046059
O  -0.058621 1.645601 1.478973
O  -1.275484 -3.180326 0.403302
C  -2.4549 1.13573 -0.906806
C  -3.08844 -0.911748 0.572046
C  -1.132853 0.425758 -0.399342
C  -1.536814 -0.718943 0.584596
C  -3.278358 1.622933 0.331619
C  -3.698987 0.388242 1.194367
C  -3.257208 0.068973 -1.634718
C  -3.574205 -1.009924 -0.866072
C  -0.184796 1.423421 0.250183
C  -0.795555 -2.025796 0.328011
C  1.518324 3.128452 -0.242987
C  1.428666 -2.979362 -0.126734
C  2.879212 2.478227 0.073187
C  2.88027 -2.484998 -0.201659
C  3.827847 3.557844 0.646713
C  3.486136 1.792556 -1.171316
C  3.30318 -1.777319 1.10575
C  3.806264 -3.683077 -0.522478
H  -2.185111 1.980898 -1.562956
H  -3.355087 -1.803145 1.162351
H  -0.618435 0.024289 -1.287286
H  -1.239762 -0.396322 1.605816
H  -2.673797 2.330037 0.928656
H  -4.16607 2.172748 -0.027394
H  -4.798194 0.289832 1.230597
H  -3.339997 0.500025 2.234937
H  -3.532177 0.179335 -2.689083
H  -4.13752 -1.877989 -1.222426
H  1.102981 3.625878 0.651917
H  1.597607 3.841695 -1.081715
H  1.119401 -3.503062 -1.050531
H  1.267702 -3.660587 0.730584
H  2.706832 1.713399 0.856093
H  2.943781 -1.75479 -1.034069
H  4.001787 4.366306 -0.089785
H  3.417286 4.01281 1.567216
H  4.80949 3.116129 0.895924
H  3.72174 2.538821 -1.95494
H  4.423978 1.268729 -0.909587
H  2.785219 1.055094 -1.600755
H  2.627388 -0.935479 1.33604
H  3.276245 -2.483138 1.958655
H  4.333836 -1.385814 1.023237
H  3.757112 -4.445425 0.278679
H  3.531167 -4.171104 -1.47624
H  4.856462 -3.349508 -0.602576
