program: Gaussian 09
title: 000019695
version: EM64L-G09RevD.01
frameworkgroup: C1[X(C9H20O2)]
method: RPBEPBE
basis: SDD
operation: Freq
keyword: #pfreq=noraman
keyword: PBEPBE/SDD
title: #p freq=noraman PBEPBE/SDD
converged: YES YES NO NO
title: Mulliken charges:
elementType: O O C C C C C C C C C H H H H H H H H H H H H H H H H H H H H
charge: -0.265508 -0.273301 -0.020901 -0.415475 0.030873 -0.723316 -0.712340 -0.200624 -0.232881 -0.683760 -0.674337 0.236160 0.228071 0.190917 0.165429 0.215173 0.213957 0.201540 0.218052 0.211851 0.201451 0.173954 0.223011 0.184302 0.191583 0.202020 0.232665 0.222796 0.201890 0.231736 0.225009
chargesum: 0.00000
title: Mulliken charges with hydrogens summed into heavy atoms:
elementType: O O C C C C C C C C C
charge: -0.265508 -0.273301 0.215259 0.003513 0.196302 -0.092646 -0.080987 0.196342 0.143004 -0.026278 -0.015701
polarizability: 1.18472845e+02 -1.61421754e+00 1.12684305e+02 1.46311562e+00 -1.88114012e-02 9.22965232e+01
1716.lowfreq: -8.5152 -0.0008 -0.0007 -0.0003 5.8551 9.7571 34.1486 38.0536 41.8547
frequency: 33.9750 37.5301 41.5427 58.6947 70.2408 86.7447 160.9979 193.0371 200.9781 215.4987 236.6241 242.5358 247.0177 278.5202 314.0650 335.2139 391.7205 403.0779 496.7100 531.3564 544.7076 786.2965 812.8965 813.2755 815.1125 860.1381 891.4906 915.4543 935.9916 951.4318 958.7910 987.3522 1042.2355 1049.2895 1093.3980 1105.0469 1118.6745 1135.2650 1136.7615 1142.2280 1162.0231 1179.2947 1242.3855 1243.6690 1250.9190 1277.7009 1321.6172 1324.4046 1340.5414 1349.3328 1372.6323 1377.3912 1384.5200 1391.4629 1395.0028 1399.0132 1445.4418 1458.4891 1460.3188 1466.8059 1470.3575 1478.1078 1480.9939 1481.7697 1487.6640 1492.4173 1494.2342 2871.1019 2918.9861 2930.2445 2962.8828 2966.4904 2967.0053 2978.3844 2992.5965 2992.8754 3001.3402 3026.2053 3050.5381 3053.9265 3065.0203 3066.5786 3069.7054 3089.7584 3090.2064 3100.6823 3100.7451
redmass: 1.8796 2.3587 3.0391 2.2401 2.9730 2.3271 2.4958 2.2958 1.1941 2.0377 1.2805 1.2824 1.3113 2.7947 3.1003 2.7668 2.4101 2.1464 2.9876 2.9437 3.9930 2.1417 1.1585 1.1081 2.3464 2.6672 1.9539 1.1866 3.7498 1.4529 2.0508 2.1779 3.4054 2.7840 3.2379 1.9980 2.2523 1.5063 1.4960 2.1262 2.2999 1.8066 1.3464 1.2081 1.1539 1.2611 1.2479 1.2039 1.3699 1.4276 1.3106 1.3043 1.2285 1.2172 1.2881 1.3237 1.0886 1.0410 1.0410 1.0480 1.0523 1.0488 1.0484 1.0569 1.0469 1.0783 1.0822 1.0819 1.0560 1.0654 1.0357 1.0400 1.1017 1.0635 1.0359 1.0358 1.0821 1.0959 1.0991 1.0991 1.0994 1.0984 1.0987 1.0988 1.0991 1.1011 1.1009
irintensity: 1.8386 0.1455 0.6098 0.2917 0.6232 3.4169 4.1540 1.3082 0.5570 0.9042 0.3709 0.5954 1.6372 2.2940 6.9012 1.7047 1.4531 0.7539 3.9930 5.5994 0.7968 2.6613 3.7561 4.1338 16.3289 9.5288 12.5462 4.1582 168.2217 17.7629 30.0802 24.1954 126.4679 47.0714 64.9566 2.5442 30.2764 0.8020 7.9913 24.8017 22.8055 11.5568 1.6293 3.6025 0.4605 2.4106 34.9906 14.4471 5.0710 30.7847 21.0053 7.3911 18.1846 11.5329 13.6149 13.8302 5.5428 11.2160 10.6077 1.4722 7.7500 7.3151 8.0180 3.0513 23.7179 6.1325 3.8895 49.4294 59.7007 79.7667 42.7723 35.7063 47.8474 27.0314 37.0531 16.4102 7.0440 28.1296 10.1263 11.3798 38.3320 95.7547 71.5614 36.4675 37.2941 41.8355 35.4942
temp: 298.150 k
press: 1.00000 atm
elementType: 8 8 6 6 6 6 6 6 6 6 6 1 1 1 1 1 1 1 1 1 1 1 1 1 1 1 1 1 1 1 1
symmnumber: 1
zpe: 724911.3 jmol-1
zpe.correction: 0.276104 hartree
zpe.thermalcorrener: 0.291236 hartree
zpe.thermalcorrenthalpy: 0.292180 hartree
zpe.thermalcorrgfe: 0.232353 hartree
zpe.sumelectzpe: -504.439450 hartree
zpe.sumelectthermal: -504.424318 hartree
zpe.sumelectthermalent: -504.423374 hartree
zpe.sumelectthermalfe: -504.483201 hartree
dipole: 0.6200 -0.6211 2.1321
dipole: 2.3056
quadrupole: -68.3062 -66.2583 -71.6083
quadrupole: 0.3629 2.8410 0.1975
quadrupole: 0.4181 2.4660 -2.8840 0.3629 2.8410 0.1975
hfenergy: -504.7155539 hartree
pointgroup: C01 [X(C9H20O2)]
dipole: 0.2012785 0.2426755 -0.8505538 debye
polarizability: 118.00337|2.127762|113.0596472|-1.9836033|-0.8581149|92.3906559 unknown
InChI: InChI=1S/C9H20O2/c1-5-10-9(11-6-2)7-8(3)4/h8-9H,5-7H2,1-4H3
charge 0 multiplicity 1
31 atoms
O  0.307696 -1.219041 0.371384
O  1.350122 0.908754 0.395626
C  -2.4146 -0.023039 0.128628
C  -1.11167 0.7063 0.548677
C  0.171645 0.1436 -0.071513
C  -2.699995 0.111338 -1.387264
C  -3.608372 0.512706 0.953329
C  1.461355 -1.928171 -0.221675
C  1.786028 1.956754 -0.540866
C  1.401854 -3.375627 0.26308
C  3.046329 2.59529 0.043401
H  -2.277645 -1.096714 0.36351
H  -0.98559 0.649066 1.646376
H  -1.182219 1.780872 0.282093
H  0.161658 0.186057 -1.190201
H  -1.90206 -0.344621 -2.001932
H  -3.649143 -0.39073 -1.652168
H  -2.790434 1.176677 -1.677861
H  -3.43271 0.390611 2.038445
H  -4.541473 -0.023039 0.696863
H  -3.773423 1.59022 0.75583
H  1.392477 -1.871391 -1.331787
H  2.395219 -1.427527 0.097633
H  1.992383 1.509714 -1.53969
H  0.98617 2.71908 -0.66773
H  2.24989 -3.95408 -0.147284
H  1.453758 -3.412542 1.364833
H  0.460729 -3.856882 -0.054914
H  3.420846 3.394128 -0.622757
H  2.83118 3.033944 1.032866
H  3.840393 1.838795 0.168369
