program: Gaussian 09
title: 000239660
version: EM64L-G09RevD.01
frameworkgroup: C1[X(C18H30O4)]
method: RPBEPBE
basis: SDD
operation: Freq
keyword: #pfreq=noraman
keyword: PBEPBE/SDD
title: #p freq=noraman PBEPBE/SDD
converged: YES YES NO NO
title: Mulliken charges:
elementType: O O O O C C C C C C C C C C C C C C C C C C H H H H H H H H H H H H H H H H H H H H H H H H H H H H H H
charge: -0.270649 -0.282400 -0.241780 -0.227037 -0.251306 -0.242073 -0.066160 -0.545386 0.433420 -0.432212 -0.730356 0.208534 0.185984 -0.827984 -0.294892 -0.286341 -0.048176 -0.047769 -0.697019 -0.687997 -0.686037 -0.697081 0.282854 0.266296 0.226366 0.235727 0.261393 0.216565 0.206516 0.221581 0.226498 0.226635 0.222118 0.224517 0.214753 0.228675 0.232565 0.214012 0.210813 0.212314 0.211992 0.212820 0.221089 0.235343 0.214775 0.208953 0.225390 0.214291 0.212474 0.221515 0.213118 0.212757
chargesum: 0.00000
title: Mulliken charges with hydrogens summed into heavy atoms:
elementType: O O O O C C C C C C C C C C C C C C C C C C
charge: -0.270649 -0.282400 -0.241780 -0.227037 0.031548 0.024223 0.160206 -0.048267 0.433420 -0.215647 -0.075761 0.208534 0.185984 -0.154713 0.148537 0.160237 0.162637 0.164545 -0.051118 -0.028926 -0.033882 -0.049691
polarizability: 2.32285024e+02 2.48328614e+00 2.02990186e+02 -7.06733581e-01 -1.30382339e+01 1.81113442e+02
1716.lowfreq: -13.5814 -8.7501 -7.5855 -1.9116 -0.0004 0.0006 0.0006 13.6797 25.7280
frequency: -8.3662 13.3999 25.5491 34.3769 45.0119 46.2961 51.1314 62.7821 67.6981 89.1211 96.9167 141.7551 156.6879 182.1305 194.3822 195.6199 204.4155 222.2498 224.8833 229.0668 236.2987 241.9370 255.6667 266.4859 278.5370 295.8303 320.5567 329.5412 362.6285 368.2718 393.5649 406.2154 411.3715 413.2591 443.4832 471.1929 492.6635 510.5937 563.4299 586.0209 611.1402 672.2161 722.9077 739.7155 783.4384 810.4681 814.5583 817.4853 831.1619 863.3951 869.3463 896.3403 907.3505 916.7988 917.8864 921.7086 934.8419 947.1978 957.6380 961.6176 965.1800 968.5270 976.0146 997.3539 1006.3290 1047.7511 1055.8097 1082.6610 1102.8375 1118.7728 1133.0210 1133.1891 1134.6811 1160.0308 1166.2295 1167.1167 1183.5426 1184.0222 1185.9015 1204.6191 1234.0454 1250.3373 1253.6093 1258.1722 1287.3367 1290.9752 1293.8122 1297.6942 1311.5857 1333.4214 1342.7168 1344.6139 1350.9150 1357.9589 1362.3584 1375.2369 1379.4984 1380.9899 1391.6222 1393.3433 1398.0789 1399.6391 1435.0385 1451.3563 1456.3643 1459.9059 1465.7330 1467.4937 1468.1636 1470.8032 1471.2045 1471.7864 1473.1448 1482.6911 1482.7345 1488.6395 1488.6826 1621.7362 1637.0001 1695.6871 2920.3470 2959.7710 2972.0719 2972.6160 2979.4964 2979.7111 2983.1845 2983.5561 2984.8600 2985.7371 2995.9599 3010.6850 3011.4030 3032.1622 3035.9377 3042.2650 3064.0487 3064.3837 3073.2809 3074.3953 3076.0287 3078.3814 3079.0327 3079.3285 3080.7599 3081.7661 3087.4046 3088.5509 3090.8600 3095.2380
redmass: 4.2158 3.5395 3.9539 3.5983 2.8877 3.1182 4.2295 5.9575 3.6491 3.6353 4.3002 1.6246 2.9248 1.6884 1.1897 1.1212 1.5802 2.0025 1.3114 1.1841 1.4765 3.4601 3.0820 2.6039 2.8136 3.4205 3.6397 3.5827 2.7161 2.6387 2.7702 2.0258 1.8787 2.1836 3.7738 4.4664 3.6662 4.9842 3.8222 4.8452 4.7440 4.7796 3.7659 5.1601 3.1503 2.1687 2.5832 2.0215 3.2677 3.1609 2.7838 2.1204 1.7563 1.2195 1.2089 2.2542 1.6621 1.6442 2.0414 2.3125 1.6043 1.8048 1.8943 2.1038 1.7702 1.6356 1.8575 2.3851 3.2419 2.9724 1.5981 2.2948 2.2925 2.8357 1.9501 1.9316 1.9220 1.8061 1.8408 1.4035 1.2482 1.2140 1.2134 1.5923 1.5232 1.3549 1.3505 1.2910 1.4677 1.5673 1.3889 1.4186 1.4212 1.3841 1.4595 1.9469 1.2149 1.2100 1.2159 1.2456 1.2092 1.2102 1.0934 1.0899 1.0821 1.0466 1.0552 1.0503 1.0463 1.0517 1.0651 1.0590 1.0573 1.0544 1.0567 1.0511 1.0487 9.0543 10.0620 7.0183 1.0815 1.0371 1.0357 1.0358 1.0359 1.0359 1.0761 1.0836 1.0372 1.0837 1.0649 1.0567 1.0571 1.0969 1.0827 1.0993 1.1000 1.1001 1.1008 1.1007 1.0988 1.0985 1.0993 1.0997 1.0990 1.0991 1.1069 1.1071 1.0914 1.0987
irintensity: 0.3821 0.2865 0.3363 0.1218 0.1010 0.0794 0.3967 0.7374 0.0294 0.7224 2.0257 2.6460 0.8980 0.1817 0.0270 0.0377 0.2407 0.1330 0.8066 0.7246 1.2754 3.2279 1.7270 2.1164 1.7397 4.8729 17.2879 7.3126 3.8371 6.9478 6.2932 2.9926 1.5533 5.8406 1.1080 2.7801 4.3734 3.0182 7.0018 1.8390 7.2637 3.9121 2.7889 6.3931 13.7571 7.8639 1.5615 12.9731 2.2166 0.7768 7.5243 9.2552 2.8320 6.8181 6.1245 3.5874 16.5262 12.1136 62.8301 56.5267 7.5527 23.4684 29.5894 31.1522 11.5013 71.3669 32.2118 4.5281 264.3959 270.0317 86.6670 0.4900 0.6528 10.3030 3.9401 10.1320 15.0727 1.1977 0.7474 9.6066 24.7731 10.0721 13.3909 56.6976 7.0036 0.6709 2.5056 3.8436 11.0460 3.6465 0.1101 2.1043 8.2168 8.1052 9.1100 11.3800 20.5025 16.8756 10.6485 12.4658 11.5488 11.0125 30.0247 7.8714 5.4784 15.6254 17.4441 4.1511 3.5191 0.3669 12.7025 10.4426 12.6348 12.3567 8.6739 26.9588 19.9570 107.7925 155.6919 4.9360 37.2398 41.7171 38.6149 34.1013 19.7618 20.3241 19.8314 10.1037 35.7611 14.1962 25.9874 38.4957 42.2739 19.7669 7.6014 6.5031 24.5736 27.1960 10.5572 9.2440 32.2120 16.2322 52.9459 64.9013 51.5356 47.1680 31.9943 29.9116 33.6489 39.7618
temp: 298.150 k
press: 1.00000 atm
elementType: 8 8 8 8 6 6 6 6 6 6 6 6 6 6 6 6 6 6 6 6 6 6 1 1 1 1 1 1 1 1 1 1 1 1 1 1 1 1 1 1 1 1 1 1 1 1 1 1 1 1 1 1
symmnumber: 1
zpe: 1172586.6 jmol-1
zpe.correction: 0.446615 hartree
zpe.thermalcorrener: 0.471943 hartree
zpe.thermalcorrenthalpy: 0.472887 hartree
zpe.thermalcorrgfe: 0.389323 hartree
zpe.sumelectzpe: -1003.065788 hartree
zpe.sumelectthermal: -1003.040460 hartree
zpe.sumelectthermalent: -1003.039516 hartree
zpe.sumelectthermalfe: -1003.123080 hartree
dipole: -0.4063 -2.6706 1.2536
dipole: 2.9781
quadrupole: -121.0572 -133.0491 -134.9100
quadrupole: -5.1487 -0.4388 0.7295
quadrupole: 8.6149 -3.3770 -5.2379 -5.1487 -0.4388 0.7295
hfenergy: -1003.512403 hartree
pointgroup: C01 [X(C18H30O4)]
dipole: 0.0871859 1.0332661 0.5454844 debye
polarizability: 231.7073674|2.0635854|202.0258138|4.6236494|14.1372329|182.6554707 unknown
InChI: InChI=1S/C18H30O4/c1-11(2)9-21-17(19)15-8-13(5)7-14(6)16(15)18(20)22-10-12(3)4/h7,11-12,14-16H,8-10H2,1-6H3
charge 0 multiplicity 1
52 atoms
O  2.071633 1.827789 0.266391
O  -2.668792 0.815006 0.031684
O  1.910689 0.44313 -1.599743
O  -2.956819 -1.422994 -0.565413
C  0.112144 0.434547 0.123125
C  -0.761629 -0.311403 -0.933705
C  0.223878 -0.447556 1.415255
C  -0.191995 -1.702125 -1.307873
C  0.440947 -2.452813 -0.147124
C  0.630276 -1.873762 1.069179
C  1.108675 0.142695 2.537171
C  1.443549 0.845414 -0.507292
C  -2.222212 -0.41473 -0.473606
C  0.862733 -3.877825 -0.44265
C  3.361714 2.392257 -0.234858
C  -4.094415 0.921557 0.463894
C  4.55752 1.850955 0.572136
C  -4.867893 1.863822 -0.476856
C  5.816932 2.67565 0.207391
C  4.787384 0.342738 0.326927
C  -4.955003 1.293044 -1.909542
C  -6.274185 2.1202 0.118219
H  -0.393219 1.373881 0.41229
H  -0.7867 0.313181 -1.85057
H  -0.813769 -0.469803 1.819236
H  -1.007958 -2.318411 -1.732394
H  0.567591 -1.570427 -2.100935
H  1.086488 -2.458861 1.88104
H  0.985638 -0.458118 3.458005
H  0.830375 1.18715 2.762912
H  2.177258 0.134016 2.263721
H  -0.010127 -4.497425 -0.728937
H  1.570514 -3.9134 -1.294793
H  1.349778 -4.351007 0.427685
H  3.251629 3.481598 -0.095463
H  3.46237 2.149929 -1.309041
H  -4.537515 -0.09122 0.47507
H  -4.050905 1.330205 1.488738
H  4.333364 2.00862 1.646964
H  -4.319844 2.827384 -0.5115
H  6.06235 2.568656 -0.866688
H  5.67819 3.752031 0.421868
H  6.689798 2.323935 0.786164
H  3.898337 -0.256489 0.591435
H  5.013641 0.149258 -0.738229
H  5.636395 -0.023653 0.932924
H  -3.950616 1.134062 -2.340671
H  -5.484779 0.321914 -1.914236
H  -5.502417 1.987148 -2.573084
H  -6.843934 2.815809 -0.523659
H  -6.21583 2.563321 1.130206
H  -6.852932 1.17932 0.18943
