program: Gaussian 09
title: 000239652
version: EM64L-G09RevD.01
frameworkgroup: C1[X(C9H19NO)]
method: RPBEPBE
basis: SDD
operation: Freq
keyword: #p
keyword: freq=noraman
keyword: PBEPBE/SDD
title: #p freq=noraman PBEPBE/SDD
converged: YES YES NO NO
title: Mulliken charges:
elementType: O N C C C C C C C C C H H H H H H H H H H H H H H H H H H H
charge: -0.268755 -0.304631 0.024367 -0.395008 -0.422199 -0.448879 -0.371983 -0.310663 -0.049435 -0.702339 -0.686858 0.165305 0.231344 0.192657 0.190638 0.218314 0.215677 0.211467 0.208502 0.193543 0.215405 0.171734 0.234225 0.206273 0.206171 0.196197 0.235982 0.232725 0.211201 0.199022
chargesum: 0.00000
title: Mulliken charges with hydrogens summed into heavy atoms:
elementType: O N C C C C C C C C C
charge: -0.268755 -0.070406 0.189672 0.028994 -0.013247 -0.021735 0.030062 0.076476 0.156838 -0.063989 -0.043910
polarizability: 1.32159126e+02 -2.13794811e+00 9.96940246e+01 9.17803288e-01 4.41532036e-01 8.92146214e+01
1716.lowfreq: -11.9377 -8.1182 -0.0010 -0.0010 -0.0007 4.9863 36.6558 46.8576 68.0783
frequency: 34.1751 46.7924 67.9496 137.9519 155.9213 204.4607 224.6523 232.3552 250.4366 273.6391 317.4277 379.9662 403.9476 437.0593 445.3671 475.5836 497.7181 570.5932 658.5768 786.9620 821.9164 824.0376 837.1663 860.0320 893.4923 910.3453 926.1774 937.1429 957.9519 982.8866 1022.2678 1048.2833 1080.4930 1089.3900 1099.8505 1122.5385 1130.9687 1164.5164 1174.2620 1181.8036 1195.5823 1233.2909 1249.2089 1261.6208 1297.2163 1303.8826 1312.3215 1327.5693 1333.9523 1340.6617 1356.5314 1363.2220 1369.0130 1376.8488 1388.8195 1446.2340 1447.0689 1457.0174 1458.8219 1462.7196 1464.0194 1469.7827 1479.0659 1483.2113 1485.6761 2877.5615 2907.6035 2920.2532 2965.4795 2966.6229 2972.1295 2978.1162 2981.9957 2983.8717 3022.3643 3034.8215 3046.3620 3059.7234 3059.9143 3068.7726 3070.0306 3072.2986 3093.9035 3409.0227
redmass: 2.9541 2.9301 3.2236 2.6464 2.7489 1.0432 2.3825 2.1032 1.3121 2.4304 1.7545 2.4636 2.6857 2.2611 3.1160 2.6659 2.3167 1.9409 1.5601 2.7681 1.8771 1.7296 2.6992 2.7171 1.5657 1.2520 1.6405 1.6143 2.0485 1.4763 2.4519 2.1674 1.4991 2.2212 2.7701 2.2398 2.1094 1.5295 2.1367 1.7052 1.7808 1.5436 1.2588 1.2111 1.2283 1.2531 1.3673 1.2608 1.3813 1.4138 1.3570 1.3769 1.3222 1.4538 1.2348 1.1589 1.0972 1.0869 1.0877 1.0520 1.0512 1.0939 1.0726 1.0711 1.0689 1.0818 1.0681 1.0692 1.0637 1.0357 1.0479 1.0732 1.0611 1.0625 1.0915 1.0971 1.1007 1.0996 1.0994 1.0955 1.0974 1.0995 1.1000 1.0736
irintensity: 1.1059 0.0955 0.4258 2.8871 1.3575 0.3729 1.1325 4.8170 1.5711 2.1724 2.4478 0.0634 1.3548 1.3582 4.6750 2.7478 3.1905 6.2038 106.0668 1.3594 4.4804 3.0920 7.0100 13.4131 6.1463 3.7629 1.3270 2.5147 1.9202 11.5370 85.0533 4.8305 16.0669 10.5110 10.8359 29.0499 14.9985 3.2215 35.2807 63.4371 2.9885 12.2827 7.3041 5.4085 10.7842 3.3938 4.9609 3.0260 1.0678 2.6586 2.1312 5.6881 28.0500 3.9642 26.9054 14.4947 16.0203 11.4953 4.9543 6.9595 1.5746 9.3499 9.2344 8.0752 13.0912 57.4331 61.9977 84.5398 39.4334 26.4299 18.9243 30.9568 36.8755 25.7687 29.4145 46.6478 64.4744 11.2345 33.1417 51.1959 100.1355 39.6650 37.5587 2.3097
temp: 298.150 k
press: 1.00000 atm
elementType: 8 7 6 6 6 6 6 6 6 6 6 1 1 1 1 1 1 1 1 1 1 1 1 1 1 1 1 1 1 1
symmnumber: 1
zpe: 708914.6 jmol-1
zpe.correction: 0.270011 hartree
zpe.thermalcorrener: 0.282636 hartree
zpe.thermalcorrenthalpy: 0.283580 hartree
zpe.thermalcorrgfe: 0.230676 hartree
zpe.sumelectzpe: -483.389911 hartree
zpe.sumelectthermal: -483.377286 hartree
zpe.sumelectthermalent: -483.376342 hartree
zpe.sumelectthermalfe: -483.429246 hartree
dipole: -0.0500 0.7715 0.8798
dipole: 1.1712
quadrupole: -62.7864 -74.4104 -67.3245
quadrupole: 2.3338 1.0228 -0.9118
quadrupole: 5.3874 -6.2367 0.8493 2.3338 1.0228 -0.9118
hfenergy: -483.6599222 hartree
pointgroup: C01 [X(C9H19N1O1)]
dipole: 0.0025998 -0.4598152 -0.0297935 debye
polarizability: 131.7132656|-1.5538024|93.6172804|-4.1923795|5.3488957|95.7372255 unknown
InChI: InChI=1S/C9H19NO/c1-8(2)10-7-9-5-3-4-6-11-9/h8-10H,3-7H2,1-2H3
charge 0 multiplicity 1
30 atoms
O  -1.601487 0.909475 1.113545
N  1.650701 -0.48328 -0.051192
C  -0.748742 -0.080099 0.416581
C  -1.300247 -0.38339 -0.989578
C  -2.760199 -0.887863 -0.903699
C  0.668739 0.517286 0.421688
C  -3.628167 0.126751 -0.120404
C  -2.98703 0.427265 1.24888
C  2.991665 0.029748 -0.437981
C  3.799575 -1.123624 -1.067501
C  3.781073 0.693591 0.72543
H  -0.751805 -1.025698 1.015161
H  -0.637385 -1.120534 -1.478228
H  -1.262818 0.548944 -1.588283
H  -2.780938 -1.868308 -0.382735
H  -3.174345 -1.053962 -1.915743
H  0.866463 0.911884 1.445471
H  0.694894 1.382356 -0.268835
H  -3.707675 1.06931 -0.696372
H  -4.654949 -0.26114 0.030974
H  -3.518027 1.232246 1.784739
H  -2.99719 -0.492319 1.878928
H  1.736092 -1.271957 0.608034
H  2.816386 0.79884 -1.218138
H  4.785684 -0.771243 -1.420283
H  3.976017 -1.928051 -0.325944
H  3.248931 -1.557201 -1.919984
H  3.204317 1.51666 1.185208
H  4.7402 1.111514 0.365793
H  4.007471 -0.050902 1.51367
