program: Gaussian 09
title: 000239650
version: EM64L-G09RevD.01
frameworkgroup: C1[X(C12H21NO2)]
method: RPBEPBE
basis: SDD
operation: Freq
keyword: #p
keyword: freq=noraman
keyword: PBEPBE/SDD
title: #p freq=noraman PBEPBE/SDD
converged: YES YES NO NO
title: Mulliken charges:
elementType: O O N C C C C C C C C C C C C H H H H H H H H H H H H H H H H H H H H H
charge: -0.269381 -0.289325 -0.369789 0.314329 -0.415452 -0.063098 0.019809 -0.073691 -0.726984 -0.745914 -0.455263 -0.734281 -0.430661 -0.221613 -0.139015 0.217482 0.186679 0.180973 0.190826 0.281507 0.253326 0.215761 0.212193 0.216470 0.205495 0.206650 0.237199 0.252537 0.212021 0.226878 0.230494 0.205879 0.218349 0.215843 0.208902 0.224864
chargesum: 0.00000
title: Mulliken charges with hydrogens summed into heavy atoms:
elementType: O O N C C C C C C C C C C C C
charge: -0.269381 -0.289325 -0.088281 0.314329 -0.011292 0.117875 0.210635 0.179635 -0.082559 -0.096571 0.009295 -0.071030 0.003530 -0.012710 0.085850
polarizability: 1.68068225e+02 -3.46005997e+00 1.44177634e+02 1.33336555e+00 -9.95805939e-01 1.06489785e+02
1716.lowfreq: -4.2662 -0.0008 0.0003 0.0005 4.4400 9.0804 45.1551 62.6192 91.7936
frequency: 45.0979 62.5897 91.7459 123.5174 143.8926 151.0640 179.8304 197.1988 208.9897 217.2046 231.4083 269.4288 284.8666 317.9459 330.6791 387.4882 427.8362 439.6308 453.9130 469.8572 476.2494 497.6975 499.4152 532.4710 557.9428 690.9221 717.9727 751.7150 773.4687 790.3349 838.6873 880.2056 882.4987 899.3534 901.9093 911.6663 916.9267 932.3918 959.3213 976.2922 992.1820 996.6283 1030.5350 1040.9235 1054.8148 1086.6429 1089.6518 1109.5578 1130.2303 1165.5442 1167.7783 1170.8038 1207.3590 1211.3762 1225.6916 1228.8675 1261.6840 1264.2780 1286.8845 1291.7562 1306.5629 1319.9865 1335.0428 1344.5060 1356.5790 1363.4199 1370.5461 1379.6275 1387.9175 1391.2652 1434.4178 1437.0913 1457.8208 1458.2086 1461.0930 1464.0842 1466.0619 1478.0327 1479.2702 1486.8208 1652.4779 2820.3534 2915.6497 2965.4681 2970.8154 2974.1355 2986.4391 2989.7586 2994.3362 3009.3340 3023.8346 3053.2601 3062.7984 3069.3258 3072.2323 3078.4731 3087.5297 3089.1835 3094.1583 3142.6267 3178.3530 3468.3520
redmass: 3.3283 3.7097 3.9603 3.1604 3.0548 2.5485 1.0739 1.2020 1.9095 1.9196 1.4979 3.1248 2.3416 2.8882 3.0042 2.3131 2.9852 2.5346 2.5409 2.5609 3.0843 3.2541 3.1406 2.0248 2.4733 4.2764 1.3312 2.2184 2.8035 3.3565 3.1500 2.4871 2.1947 2.3201 2.0724 1.3488 1.4924 1.9489 1.6316 2.9365 1.3212 3.0912 2.4800 1.8399 2.0134 1.8562 2.2281 3.2691 2.1359 2.0413 2.0978 1.3999 1.7198 1.8705 1.5306 1.5799 1.6765 1.3425 1.3276 1.3598 1.2368 1.4862 1.2934 1.3799 1.4794 1.4817 1.3088 1.4667 1.2481 1.3050 1.2554 1.2168 1.0751 1.0570 1.0519 1.0548 1.0970 1.0580 1.0794 1.0701 6.3230 1.0792 1.0831 1.0641 1.0357 1.0367 1.0489 1.0452 1.0691 1.0842 1.0908 1.1020 1.0989 1.0986 1.0990 1.0998 1.0993 1.0996 1.1001 1.0858 1.1011 1.0747
irintensity: 0.3776 1.9132 2.1062 0.1272 0.5149 1.6693 0.1268 0.4682 2.2500 0.4632 0.3750 2.1935 1.2071 3.6087 1.7160 3.0906 21.1667 12.7394 3.8706 1.5060 3.6036 2.3696 1.5858 50.4710 61.2486 17.3768 47.5246 3.6528 5.1371 19.9678 15.1237 16.3541 2.7847 2.5645 7.1924 1.3794 1.0011 9.5752 4.2766 16.8011 5.7783 58.4106 47.0208 24.4890 77.0140 5.8626 15.8032 19.1912 7.7519 22.8475 29.4874 1.6114 19.4319 74.0354 8.3111 91.3020 38.2092 2.0624 30.8130 1.7130 4.4540 11.6790 25.9529 7.5534 12.1807 3.9232 21.0886 21.4594 20.3183 24.9473 50.0064 23.6330 9.8686 0.5249 7.7345 8.4269 6.5791 5.2311 6.6205 20.8721 83.9865 87.4743 50.8749 46.6887 27.8554 32.3087 15.1377 46.3385 8.0335 16.3540 53.6563 17.7070 6.7873 60.3688 46.3664 22.3565 19.9026 53.1757 32.4739 3.7356 36.2751 6.5637
temp: 298.150 k
press: 1.00000 atm
elementType: 8 8 7 6 6 6 6 6 6 6 6 6 6 6 6 1 1 1 1 1 1 1 1 1 1 1 1 1 1 1 1 1 1 1 1 1
symmnumber: 1
zpe: 821308.5 jmol-1
zpe.correction: 0.312820 hartree
zpe.thermalcorrener: 0.328535 hartree
zpe.thermalcorrenthalpy: 0.329479 hartree
zpe.thermalcorrgfe: 0.270862 hartree
zpe.sumelectzpe: -673.840337 hartree
zpe.sumelectthermal: -673.824622 hartree
zpe.sumelectthermalent: -673.823678 hartree
zpe.sumelectthermalfe: -673.882294 hartree
dipole: 0.7978 0.0599 0.9975
dipole: 1.2787
quadrupole: -82.5424 -90.1836 -94.5097
quadrupole: -0.7814 1.4917 0.5570
quadrupole: 6.5361 -1.1050 -5.4311 -0.7814 1.4917 0.5570
hfenergy: -674.1531567 hartree
pointgroup: C01 [X(C12H21N1O2)]
dipole: 0.2988686 0.283844 0.2884763 debye
polarizability: 168.3997056|1.143561|129.6977007|3.0492404|-18.0128531|120.6382387 unknown
InChI: InChI=1S/C12H21NO2/c1-9-8-12(2,3)13-11(15-9)10-6-4-5-7-14-10/h5,7,9-11,13H,4,6,8H2,1-3H3
charge 0 multiplicity 1
36 atoms
O  0.546086 0.910281 -1.063373
O  -1.702113 -1.312134 0.835507
N  0.981762 -1.10921 0.165765
C  2.41866 -0.827585 0.438946
C  2.883266 0.172596 -0.663079
C  0.106838 0.054194 0.049181
C  1.935185 1.382319 -0.826815
C  -1.323422 -0.390841 -0.281607
C  2.667761 -0.250104 1.86734
C  3.189555 -2.157854 0.288408
C  -2.327948 0.763928 -0.408672
C  2.292965 2.27244 -2.017442
C  -3.742539 0.20831 -0.707231
C  -4.048156 -0.964869 0.207464
C  -3.076318 -1.599741 0.914988
H  2.918002 -0.36719 -1.628242
H  3.904386 0.534493 -0.431205
H  0.089022 0.694116 0.971982
H  1.932197 1.986722 0.110145
H  0.567187 -1.852993 0.741524
H  -1.29831 -0.994314 -1.210218
H  2.321769 -0.968436 2.633927
H  3.745267 -0.064031 2.035156
H  2.132053 0.702098 2.03367
H  4.277166 -2.000861 0.408923
H  2.865915 -2.889793 1.053838
H  2.999671 -2.595023 -0.707312
H  -1.978406 1.445013 -1.203223
H  -2.341047 1.332961 0.541181
H  2.255931 1.689149 -2.954526
H  1.579034 3.109911 -2.102818
H  3.310589 2.687233 -1.899917
H  -3.818601 -0.095167 -1.771841
H  -4.496923 1.005612 -0.56135
H  -5.083347 -1.297714 0.337772
H  -3.258339 -2.405512 1.632058
