program: Gaussian 09
title: 000239647
version: EM64L-G09RevD.01
frameworkgroup: C1[X(C14H25N)]
method: RPBEPBE
basis: SDD
operation: Freq
keyword: #pfreq=noraman
keyword: PBEPBE/SDD
title: #p freq=noraman PBEPBE/SDD
converged: YES YES NO NO
title: Mulliken charges:
elementType: N C C C C C C C C C C C C C C H H H H H H H H H H H H H H H H H H H H H H H H H
charge: -0.083484 0.392341 -0.505188 -0.171831 -0.472748 -0.016418 -0.471038 -0.297149 -0.478557 -0.476645 -0.758315 -0.759094 0.209714 -0.754134 -0.794714 0.206801 0.211422 0.195255 0.187546 0.192283 0.206137 0.206461 0.200797 0.231283 0.232154 0.260115 0.254678 0.233877 0.210360 0.213823 0.209625 0.208804 0.210418 0.215384 0.210189 0.214935 0.212011 0.238128 0.238771 0.236002
chargesum: 0.00000
title: Mulliken charges with hydrogens summed into heavy atoms:
elementType: N C C C C C C C C C C C C C C
charge: -0.083484 0.392341 -0.086965 0.023423 -0.092920 0.189719 -0.063781 -0.065867 0.013713 0.011910 -0.124507 -0.124487 0.209714 -0.116998 -0.081813
polarizability: 1.90328946e+02 -1.53954806e+00 1.49639859e+02 -8.13007827e-01 3.84961232e+00 1.34652702e+02
1716.lowfreq: -13.3337 -0.0006 -0.0004 0.0004 9.3079 11.5560 21.5827 43.1781 71.0042
frequency: 5.7699 43.0742 70.8253 74.8205 129.2488 133.6316 150.4162 160.0654 209.0907 213.6641 220.1520 229.8686 243.8510 274.3119 299.9728 312.5367 354.8401 381.1943 390.2931 404.3960 430.1522 448.5372 474.4966 484.2438 518.9590 567.0416 619.4381 735.8907 767.8961 796.6270 798.9623 847.6657 853.6583 863.1248 867.0356 886.0786 901.4281 918.2839 930.5651 944.7767 957.7154 978.0966 981.9421 1010.0209 1016.5223 1026.6451 1041.8862 1048.2171 1075.0176 1080.4255 1092.2226 1095.4391 1103.0913 1125.3060 1155.3235 1177.5140 1178.0064 1186.7721 1197.0868 1218.9852 1244.5492 1271.8396 1275.9908 1286.9129 1291.7444 1310.7043 1329.6774 1340.1634 1350.5746 1356.4313 1372.4126 1378.1769 1383.4831 1388.0960 1389.8760 1415.7929 1442.1003 1451.5720 1452.6536 1463.7138 1464.9153 1465.3193 1468.9486 1472.7635 1476.8127 1477.6578 1480.1057 1492.2696 1639.0148 2918.2982 2944.4952 2953.3937 2960.9024 2963.3368 2964.4193 2970.4887 2974.1523 2977.8840 3007.9483 3020.9459 3035.4248 3055.1772 3055.6314 3059.4827 3061.4348 3062.0752 3063.8035 3071.4050 3092.3500 3098.4755 3102.8887 3128.3102 3199.7615 3218.3159
redmass: 2.9477 3.4824 3.1817 2.5155 2.0162 1.1729 2.4197 2.8729 1.0916 1.3857 1.8474 2.4419 1.4611 1.4524 2.4327 2.6526 3.0769 3.1157 2.9219 2.3034 2.5817 2.2496 3.0407 2.6272 2.3647 2.7290 3.2718 2.6098 2.4791 1.1745 2.2201 2.2919 1.5256 1.5703 1.6794 2.7068 2.8060 1.8458 1.4676 2.0437 1.9337 1.5436 1.5237 1.4499 1.9484 1.6553 1.1882 1.7012 1.2951 2.2504 1.2793 1.1222 2.4296 2.1212 2.2484 1.3823 2.4110 2.4866 2.3379 1.6709 2.0808 1.4362 1.2942 1.3186 1.6847 1.4695 1.3947 1.4186 1.4353 1.5501 1.2108 1.2855 1.2700 1.6787 1.2259 1.0893 1.3508 1.0801 1.0824 1.0709 1.0694 1.0576 1.0510 1.0514 1.0685 1.0577 1.0613 1.0569 7.9713 1.0794 1.0638 1.0766 1.0425 1.0485 1.0366 1.0389 1.0595 1.0375 1.1010 1.1021 1.1022 1.0970 1.0995 1.0993 1.0989 1.0989 1.0991 1.0975 1.0500 1.0607 1.0972 1.0909 1.1177 1.1159
irintensity: 0.1855 2.2386 0.2450 0.0322 0.3764 0.3569 0.2584 0.2899 0.0277 0.6795 1.4122 0.5633 0.0685 0.0152 0.3919 0.1719 0.5666 1.8615 1.1613 0.0162 1.0971 0.3961 4.9762 1.3167 2.0603 0.5511 3.5696 0.4399 0.4535 7.4625 8.9479 5.7198 7.2497 0.3804 1.2111 16.6173 2.9005 4.4899 1.5318 2.0228 9.3448 4.1085 1.7709 1.8107 7.1194 2.1290 23.7875 3.0276 7.6893 1.4173 0.0529 1.9534 43.7026 0.6217 1.6509 0.8270 5.4324 5.0132 3.7351 31.6858 13.8626 3.2275 0.3492 1.4352 2.6971 4.1234 4.0064 3.7270 19.2201 23.8675 31.2206 27.9695 15.4562 24.8457 25.6640 11.7157 5.6133 1.9559 4.0615 3.8410 11.3427 9.2474 1.4025 4.9592 22.1165 9.5505 4.9608 18.2967 125.6206 43.6307 22.7008 26.3011 17.9583 69.4042 37.3340 43.6070 31.1516 16.6728 36.4107 24.9109 35.3754 12.6857 0.9476 27.6272 62.3545 96.3003 56.3627 57.1482 23.6498 24.3608 23.1944 24.1319 0.4853 21.6895
temp: 298.150 k
press: 1.00000 atm
elementType: 7 6 6 6 6 6 6 6 6 6 6 6 6 6 6 1 1 1 1 1 1 1 1 1 1 1 1 1 1 1 1 1 1 1 1 1 1 1 1 1
symmnumber: 1
zpe: 940852.1 jmol-1
zpe.correction: 0.358352 hartree
zpe.thermalcorrener: 0.375568 hartree
zpe.thermalcorrenthalpy: 0.376512 hartree
zpe.thermalcorrgfe: 0.312398 hartree
zpe.sumelectzpe: -601.995886 hartree
zpe.sumelectthermal: -601.978670 hartree
zpe.sumelectthermalent: -601.977725 hartree
zpe.sumelectthermalfe: -602.041840 hartree
dipole: 0.2225 -1.2043 -1.1723
dipole: 1.6953
quadrupole: -89.5986 -95.4300 -94.4877
quadrupole: -2.9320 -2.3113 0.4839
quadrupole: 3.5735 -2.2579 -1.3156 -2.9320 -2.3113 0.4839
hfenergy: -602.3542377 hartree
pointgroup: C01 [X(C14H25N1)]
dipole: -0.0815558 -0.5157699 0.4149855 debye
polarizability: 190.2743575|2.2386137|150.2804534|-0.3642267|-2.4014341|134.0666962 unknown
InChI: InChI=1S/C14H25N/c1-10-7-13(9-14(3,4)8-10)15-11(2)12-5-6-12/h10,12-13H,5-9H2,1-4H3
charge 0 multiplicity 1
40 atoms
N  -1.351666 0.194042 0.040466
C  2.324318 -0.979078 -0.361709
C  0.784152 -0.880826 -0.573176
C  0.06723 0.054528 0.437642
C  2.924251 0.459315 -0.327345
C  2.240264 1.409044 0.688649
C  0.716362 1.457363 0.421562
C  -3.713217 -0.293748 0.05151
C  -3.941814 0.218692 -1.388201
C  -4.176973 1.160934 -0.215296
C  2.941097 -1.759463 -1.551329
C  2.656158 -1.742968 0.950103
C  -2.31113 -0.53872 0.539003
C  2.860886 2.822038 0.634519
C  -2.193878 -1.647947 1.584434
H  0.333887 -1.893313 -0.523501
H  0.578702 -0.488565 -1.590657
H  0.186595 -0.3727 1.459556
H  2.824241 0.907582 -1.339692
H  4.011208 0.397361 -0.112732
H  2.40274 1.007099 1.711997
H  0.21348 2.103649 1.167509
H  0.525205 1.909876 -0.573108
H  -4.467397 -0.977423 0.455864
H  -4.805222 -0.168885 -1.937049
H  -3.029428 0.37506 -1.97026
H  -3.418189 1.928232 -0.037321
H  -5.203162 1.427585 0.054901
H  2.52835 -2.784806 -1.612537
H  2.731091 -1.251226 -2.511593
H  4.039746 -1.842022 -1.443401
H  2.233252 -2.765501 0.922778
H  3.751801 -1.833246 1.078417
H  2.255484 -1.23735 1.846841
H  2.726525 3.270818 -0.368869
H  2.386461 3.497597 1.371002
H  3.946108 2.792982 0.848456
H  -2.857054 -1.432129 2.443698
H  -2.535961 -2.606378 1.148552
H  -1.168001 -1.788102 1.959919
