program: Gaussian 09
title: 000239645
version: EM64L-G09RevD.01
frameworkgroup: C1[X(C12H12N2O3)]
method: RPBEPBE
basis: SDD
operation: Freq
keyword: #p
keyword: freq=noraman
keyword: PBEPBE/SDD
title: #p freq=noraman PBEPBE/SDD
converged: YES YES NO NO
title: Mulliken charges:
elementType: O O O N N C C C C C C C C C C C C H H H H H H H H H H H H
charge: -0.267242 -0.214645 -0.214919 -0.046383 0.022300 -0.461659 -0.038020 -0.419735 -0.217226 -0.282728 -0.138687 0.273432 -0.312294 -0.343228 0.378569 -0.352250 -0.338166 0.230574 0.236942 0.255663 0.224204 0.222925 0.216732 0.256497 0.233444 0.259330 0.260386 0.287506 0.288678
chargesum: 0.00000
title: Mulliken charges with hydrogens summed into heavy atoms:
elementType: O O O N N C C C C C C C C C C C C
charge: -0.267242 -0.214645 -0.214919 -0.046383 0.022300 0.005857 0.217643 0.027394 -0.000494 -0.026231 0.094757 0.273432 -0.052964 -0.082842 0.378569 -0.064744 -0.049488
polarizability: 3.00097498e+02 -3.87414470e+00 1.49447949e+02 5.51253394e+00 -3.37147569e+00 7.72565781e+01
1716.lowfreq: -4.0877 -0.0003 0.0004 0.0007 4.6406 7.6159 23.4560 36.7428 44.6982
frequency: 23.2365 36.6319 44.4652 67.8006 83.5061 100.4228 152.1638 192.9402 210.9156 224.0826 296.0018 308.9792 385.3194 402.2342 413.6865 452.1961 473.5286 496.7327 507.2175 521.9652 539.5143 626.6207 631.2903 668.3091 720.0003 738.3210 752.1582 761.6837 807.3652 835.4627 849.2068 860.2637 871.0017 900.9277 915.3065 936.8665 980.3616 988.2486 990.3920 998.1591 1027.5829 1047.8164 1078.1059 1092.9623 1106.6861 1130.8566 1166.6002 1170.4365 1202.2608 1211.4372 1221.2193 1228.2380 1267.0688 1289.2441 1291.7042 1322.0123 1332.6466 1351.2050 1359.3129 1366.9048 1390.3989 1426.5588 1454.8712 1463.6786 1473.7590 1579.7754 1602.6549 1655.5544 1660.6229 2970.8686 2984.2574 3000.3179 3010.4491 3028.5783 3073.8419 3148.8400 3151.9701 3165.0432 3182.9155 3188.1322 3188.7093
redmass: 4.2783 6.6243 5.2517 7.3261 5.0866 4.5682 6.4615 3.0196 5.8495 3.1652 3.3655 5.0173 7.9157 2.8227 2.9691 3.5019 5.3094 5.5502 3.3300 5.2940 3.5574 7.1682 7.5370 4.5060 1.3513 4.3284 3.6843 2.8582 5.9061 1.2707 3.2193 1.7937 2.8396 2.4653 1.3279 1.9522 1.3333 1.7101 1.6663 2.8234 3.0178 2.1087 1.7953 3.2319 1.2720 3.0672 1.2923 1.3471 1.9845 1.8056 4.1854 1.3401 1.2724 1.2763 1.1944 1.4095 1.3430 4.1831 1.7958 1.6504 7.3250 4.4648 1.0842 1.0936 2.5045 7.8485 6.6138 6.3479 8.6969 1.0638 1.0882 1.0685 1.0813 1.0930 1.1031 1.0902 1.0864 1.0895 1.0950 1.1012 1.0967
irintensity: 1.1320 0.5721 0.8655 0.4162 1.3738 7.4954 2.7267 3.0216 6.7334 8.1487 6.9176 1.4379 1.6204 6.4936 4.7122 25.5715 13.6205 3.5267 2.4792 2.1314 20.0837 1.0653 29.8336 25.5993 46.8958 7.8422 7.0059 4.3570 27.8919 3.9219 14.9962 66.4583 15.9723 13.5767 0.5227 40.4672 3.6495 9.8919 14.7400 2.5323 134.0971 51.1785 38.4753 24.1533 20.3317 57.7496 23.3532 97.4375 14.9411 105.4826 460.8686 18.3390 1.0915 1.0837 2.2827 2.1617 0.1230 48.9933 47.3128 6.5537 27.8895 20.9653 7.3406 8.5480 15.0211 13.6005 208.1940 105.9501 108.8342 43.0146 14.8582 9.0050 17.2564 36.7680 28.0167 3.7061 3.7159 2.2314 1.0613 31.7170 2.8656
temp: 298.150 k
press: 1.00000 atm
elementType: 8 8 8 7 7 6 6 6 6 6 6 6 6 6 6 6 6 1 1 1 1 1 1 1 1 1 1 1 1
symmnumber: 1
zpe: 579181.5 jmol-1
zpe.correction: 0.220599 hartree
zpe.thermalcorrener: 0.235560 hartree
zpe.thermalcorrenthalpy: 0.236504 hartree
zpe.thermalcorrgfe: 0.176049 hartree
zpe.sumelectzpe: -798.293567 hartree
zpe.sumelectthermal: -798.278606 hartree
zpe.sumelectthermalent: -798.277662 hartree
zpe.sumelectthermalfe: -798.338117 hartree
dipole: -7.2047 1.2965 0.4256
dipole: 7.3328
quadrupole: -126.2610 -93.8024 -100.9953
quadrupole: -1.6781 -4.6872 0.5944
quadrupole: -19.2414 13.2171 6.0243 -1.6781 -4.6872 0.5944
hfenergy: -798.5141657 hartree
pointgroup: C01 [X(C12H12N2O3)]
dipole: 2.8335468 -0.5079056 0.1896586 debye
polarizability: 300.2727076|-2.94784|148.5471885|-1.132913|8.4905629|77.9821291 unknown
InChI: InChI=1S/C12H12N2O3/c15-14(16)11-6-4-10(5-7-11)13-9-12-3-1-2-8-17-12/h2,4-9,12H,1,3H2
charge 0 multiplicity 1
29 atoms
O  3.625995 1.317921 0.124999
O  -5.460723 1.273631 0.298467
O  -5.680767 -0.990516 0.10669
N  0.653857 -0.441801 -0.642995
N  -4.969167 0.089655 0.124122
C  3.683835 -1.152897 0.546863
C  3.023132 0.008554 -0.240045
C  5.200478 -1.206152 0.235156
C  5.799595 0.187421 0.28965
C  1.555884 0.154483 0.078328
C  5.027521 1.304573 0.269064
C  -0.733071 -0.282331 -0.410529
C  -1.321886 1.002868 -0.216291
C  -1.565338 -1.4366 -0.455304
C  -3.50945 -0.037307 -0.063054
C  -2.710298 1.128095 -0.043709
C  -2.951485 -1.321441 -0.268814
H  3.527848 -0.987416 1.629655
H  3.182994 -2.09792 0.271427
H  3.163628 -0.152293 -1.326613
H  5.703948 -1.862022 0.970963
H  5.371989 -1.66833 -0.758486
H  6.883548 0.307133 0.382156
H  1.323994 0.760654 0.97799
H  5.405469 2.32563 0.366937
H  -0.686703 1.895069 -0.230013
H  -1.102028 -2.410549 -0.6375
H  -3.186779 2.100565 0.105426
H  -3.609122 -2.194076 -0.287739
