program: Gaussian 09
title: 000239644
version: EM64L-G09RevD.01
frameworkgroup: C1[X(C11H12O3)]
method: RPBEPBE
basis: SDD
operation: Freq
keyword: #pfreq=noraman
keyword: PBEPBE/SDD
title: #p freq=noraman PBEPBE/SDD
converged: YES YES NO NO
title: Mulliken charges:
elementType: O O O C C C C C C C C C C C H H H H H H H H H H H H
charge: -0.227654 -0.235426 -0.291643 0.457879 -0.496638 -0.373527 -0.363100 -0.224639 -0.227321 -0.230926 0.345886 -0.374900 -0.041619 -0.524585 0.227043 0.243030 0.235143 0.267684 0.228203 0.228521 0.230095 0.237000 0.228526 0.233639 0.220387 0.228941
chargesum: 0.00000
title: Mulliken charges with hydrogens summed into heavy atoms:
elementType: O O O C C C C C C C C C C C
charge: -0.227654 -0.235426 -0.291643 0.457879 -0.026565 -0.138383 -0.095416 0.003564 0.001200 -0.000831 0.345886 0.090626 0.192020 -0.075257
polarizability: 1.61424756e+02 2.51973253e+00 1.21554360e+02 -2.08520700e+01 -6.97691235e+00 9.00703498e+01
1716.lowfreq: -8.1744 -3.0550 0.0004 0.0006 0.0009 6.4578 25.2525 33.2535 43.2516
frequency: 25.2428 33.1343 43.2300 55.1671 88.2352 107.3431 160.2839 191.1102 268.9041 306.1943 332.7555 371.4206 399.4561 404.1263 451.2647 512.4676 593.1364 617.1412 621.0337 667.4078 698.7755 704.3311 757.6574 816.1302 818.3691 852.1651 858.0180 922.0341 935.6978 963.2470 970.4893 972.4378 981.4528 990.4532 1000.6544 1004.1071 1010.3818 1027.4790 1092.3846 1162.6733 1171.2486 1173.8827 1191.1086 1222.9291 1236.6078 1250.9474 1286.9384 1331.8626 1340.5509 1355.6824 1386.2658 1427.3778 1442.6076 1453.1894 1461.6675 1485.3230 1594.8389 1614.8140 1617.9731 1660.0885 3033.7413 3040.0667 3095.0465 3104.0716 3116.3243 3122.0988 3124.9495 3129.4146 3141.9818 3153.2900 3166.2036 3206.7090
redmass: 4.4698 4.0066 4.5286 4.1994 7.9234 2.6841 5.4325 4.4285 5.9376 4.6726 2.7132 2.2922 2.2338 2.7941 3.0317 3.8179 3.9024 6.1973 6.4682 2.0754 7.2843 1.8833 2.1745 3.5280 5.0377 4.3685 1.3168 1.5122 1.4888 1.8514 1.4607 1.8756 1.4234 5.2358 1.3472 1.2037 4.9556 2.2212 1.5180 2.0584 5.2204 1.0622 1.1557 2.8163 1.1657 1.1778 1.2404 1.2558 1.2097 1.2832 8.1026 1.1552 2.1767 1.1420 1.1317 2.2824 6.1070 6.1655 8.4799 4.6325 1.0572 1.0589 1.0614 1.1030 1.1071 1.0865 1.0987 1.0878 1.0922 1.0963 1.1015 1.1151
irintensity: 0.3463 0.4924 0.8401 0.0561 1.7741 0.6478 0.7439 2.8327 11.5921 9.6680 8.2591 13.3657 0.5624 0.0864 0.1259 14.0917 23.4248 0.6470 1.1058 1.4388 14.4426 63.5071 86.7020 2.5533 21.3981 165.2156 13.7109 57.6113 3.9541 29.9133 64.3361 4.3618 0.4519 0.3500 0.4630 23.7969 2.1514 4.9427 7.0697 7.8685 945.0910 9.9824 24.3873 21.0993 11.1612 7.3546 2.3865 1.2945 4.8026 21.5282 1.1097 10.2427 9.4894 29.3595 22.6639 7.1392 3.8916 7.1556 144.0405 0.1759 30.5593 29.3889 5.0566 5.1494 5.0243 4.0884 14.0701 2.1705 20.9076 26.0446 18.9597 22.9880
temp: 298.150 k
press: 1.00000 atm
elementType: 8 8 8 6 6 6 6 6 6 6 6 6 6 6 1 1 1 1 1 1 1 1 1 1 1 1
symmnumber: 1
zpe: 537887.7 jmol-1
zpe.correction: 0.204871 hartree
zpe.thermalcorrener: 0.218353 hartree
zpe.thermalcorrenthalpy: 0.219297 hartree
zpe.thermalcorrgfe: 0.161991 hartree
zpe.sumelectzpe: -650.978964 hartree
zpe.sumelectthermal: -650.965482 hartree
zpe.sumelectthermalent: -650.964538 hartree
zpe.sumelectthermalfe: -651.021844 hartree
dipole: -0.0782 0.4176 -0.0895
dipole: 0.4342
quadrupole: -65.9463 -78.4391 -81.3953
quadrupole: 1.5370 -1.7570 3.4475
quadrupole: 9.3139 -3.1788 -6.1351 1.5370 -1.7570 3.4475
hfenergy: -651.1838347 hartree
pointgroup: C01 [X(C11H12O3)]
dipole: 0.025088 0.0500278 -0.1614104 debye
dipolederiv: -1.6294462 -0.2184274 -0.2061969 -0.5590471 -0.4127095 -0.0676016 -0.7012474 -0.1806734 -0.6208594 -1.5285814 -0.3119083 -0.1405185 -0.9748191 -0.7330945 -0.0425652 -0.1368114 0.0190034 -0.3494521 -0.7349825 -0.0888343 -0.0914442 -0.2565229 -0.5826045 0.2108093 -0.1237123 0.2180693 -0.6732075 -0.0737756 -0.0334135 0.0042427 0.0363319 -0.1294518 -0.1051772 0.040311 -0.0188835 -0.0609873 1.097548 0.0789779 -0.1007526 0.4124737 0.4259917 0.1247389 -0.1972086 0.0758322 0.3230416 -0.0675208 -0.0252942 -0.053583 -0.0550929 -0.1218836 -0.0238312 0.0533317 -0.034205 0.0925083 -0.0209553 -0.0773003 0.0590088 -0.0431964 -0.110411 -0.0198499 0.0079979 -0.006189 -0.056141 0.0135588 -0.0975635 0.0963963 -0.1006475 -0.0927611 -0.0524586 0.1094245 -0.0452091 -0.0599373 -0.1353507 -0.0188955 -0.017045 -0.0159611 -0.1339889 -0.0172185 -0.0230217 -0.0434421 0.1425072 0.0180077 -0.0950313 -0.066061 -0.0780923 -0.1069867 0.0142707 -0.0675553 0.0185374 0.0104911 2.0875884 0.5637556 0.407 1.2483043 1.0191175 -0.1643249 0.7349838 -0.185368 1.0115795 0.9989373 0.0247473 0.184703 0.1001169 0.3655725 0.0374054 0.3791448 0.1874782 0.2823545 -0.1166166 -0.097358 -0.1264263 -0.0559628 -0.1615226 -0.07706 -0.2204568 -0.1583663 0.0492651 -0.1648765 -0.12778 -0.1772533 -0.1410002 -0.1407027 -0.0832718 -0.1366266 -0.0634335 -0.0257892 -0.022872 -0.0396105 -0.0466707 -0.0540354 0.0815051 -0.0007038 -0.0040452 -0.0843473 -0.0902918 -0.0421121 0.0629246 0.0114687 -0.0273452 -0.0333773 0.0070367 0.0105423 0.113606 0.0668589 0.114106 0.0255171 0.0362759 0.024971 0.1310077 0.009933 0.0118139 0.0207294 -0.1040435 0.0563214 0.0855129 -0.0627664 0.0872568 0.1104383 0.0230067 -0.0667804 0.0182797 0.0729117 -0.0382954 0.0982123 -0.0694495 0.1090464 0.1025877 0.0478346 -0.076552 0.0510326 0.0380082 0.0922723 0.0286843 0.0077332 0.0315299 0.137749 0.029064 0.033102 0.0281511 -0.1197668 -0.04252 0.0835079 0.0910743 0.0915397 0.1206128 -0.0318007 0.0963419 -0.030123 0.0332192 -0.0044859 -0.0046682 0.0317231 0.020508 0.0960281 0.0796165 -0.0086826 -0.0312964 -0.0739205 -0.0332215 0.0055434 -0.0316369 -0.0387577 -0.1163698 -0.0115893 -0.037692 0.0377966 0.1004029 0.082138 0.0385969 0.077067 0.0562568 0.0848977 0.067814 0.1372866 0.0433207 -0.0507721 -0.00901 0.1250704 0.071069 0.151557 0.0847913 0.0038393 0.086429 -0.0069387 0.0890172 0.1041447 0.0150344 0.1120424 0.0305882 0.1155649 0.0420836 0.0996829 0.0566386 -0.0269969 unknown
polarizability: 163.3042|-17.7371216|89.5822736|0.3567461|-9.0525388|120.1629925 unknown
InChI: InChI=1S/C11H12O3/c1-2-8-13-11(12)14-9-10-6-4-3-5-7-10/h2-7H,1,8-9H2
charge 0 multiplicity 1
26 atoms
O  -0.449117 -0.076601 1.464559
O  -2.184146 -1.256644 0.719752
O  -1.429627 0.556041 -0.579064
C  1.793679 0.484252 0.503482
C  0.602301 0.994717 1.28143
C  2.873225 -0.141561 1.177771
C  1.848402 0.628744 -0.907303
C  3.989027 -0.619926 0.456222
C  2.964522 0.151571 -1.629519
C  4.036805 -0.472817 -0.950017
C  -1.361129 -0.181575 0.432373
C  -3.341327 -1.439522 -0.226746
C  -4.522033 -0.616202 0.221129
C  -5.073823 0.368427 -0.530367
H  0.863751 1.24152 2.321972
H  0.12338 1.855516 0.784403
H  2.834958 -0.257509 2.267882
H  1.008301 1.100606 -1.428815
H  4.818282 -1.101765 0.985969
H  2.99927 0.266942 -2.718547
H  4.903364 -0.840799 -1.511007
H  -3.019181 -1.168762 -1.246492
H  -3.539071 -2.521615 -0.154939
H  -4.930211 -0.857495 1.212107
H  -5.942871 0.937094 -0.180953
H  -4.663628 0.636661 -1.511186
