program: Gaussian 09
title: 000239640
version: EM64L-G09RevD.01
frameworkgroup: C1[X(C11H20O4)]
method: RPBEPBE
basis: SDD
operation: Freq
keyword: #pfreq=noraman
keyword: PBEPBE/SDD
title: #p freq=noraman PBEPBE/SDD
converged: YES YES NO NO
title: Mulliken charges:
elementType: O O O O C C C C C C C C C C C H H H H H H H H H H H H H H H H H H H H
charge: -0.238062 -0.270662 -0.289608 -0.243866 -0.434142 -0.422101 0.053911 -0.411156 -0.027116 -0.239710 -0.081777 -0.697096 -0.701040 0.319766 -0.753995 0.224776 0.220161 0.224790 0.220962 0.191560 0.220379 0.215626 0.271790 0.232068 0.169301 0.217868 0.209913 0.193385 0.243828 0.219876 0.217108 0.203012 0.246505 0.246654 0.247093
chargesum: 0.00000
title: Mulliken charges with hydrogens summed into heavy atoms:
elementType: O O O O C C C C C C C C C C C
charge: -0.238062 -0.270662 -0.289608 -0.243866 0.010794 0.023651 0.245470 0.024849 0.244674 0.161659 0.136091 -0.049970 -0.061044 0.319766 -0.013743
polarizability: 1.46787394e+02 1.64569098e+00 1.36423894e+02 1.17402565e+00 2.07077159e+00 1.13886170e+02
1716.lowfreq: -9.3096 -3.4163 -0.0002 0.0003 0.0007 10.6274 22.8777 25.2376 38.9336
frequency: 22.6582 24.6851 38.9159 50.9171 60.5508 80.3800 102.4802 128.0726 154.8120 194.6648 205.8338 223.2323 233.1562 245.3117 277.4323 313.1338 362.2187 394.2724 408.5759 429.9884 437.3028 494.4136 513.5483 549.1151 564.5152 598.6138 652.5645 733.7889 798.9958 824.0613 847.2157 864.0151 871.0747 901.5245 910.4424 916.4793 927.6781 954.0114 968.9692 980.5472 994.0698 1003.4283 1040.8325 1067.7159 1095.9924 1105.0049 1132.8243 1136.9187 1151.1433 1172.8249 1188.1602 1197.4536 1206.4902 1227.5333 1252.0128 1288.7111 1298.5685 1306.5822 1312.4639 1339.3482 1341.6479 1347.8442 1353.2073 1366.1862 1375.6501 1381.7199 1388.3801 1401.8838 1445.7614 1452.0892 1456.0372 1457.4779 1464.7317 1469.5235 1474.0558 1481.8987 1482.3622 1490.4331 1658.5464 2927.0101 2932.6198 2969.7767 2972.4703 2993.1044 2998.2783 3001.7291 3005.5893 3006.6874 3038.0529 3056.3490 3059.6172 3068.2317 3068.8105 3075.9683 3076.7471 3082.4885 3091.5248 3096.9781 3140.6738
redmass: 5.8051 2.8181 2.5285 1.5712 2.2193 3.3160 3.1464 3.0333 3.9544 1.1363 4.4512 1.4727 1.6904 2.7244 2.9791 2.7667 2.5965 2.6070 2.5480 2.7092 3.5064 3.5653 2.6394 4.7517 3.4503 4.3684 3.4224 3.8947 3.9180 2.6400 3.1578 3.7175 2.1909 1.8403 1.8399 1.4408 1.5021 1.8190 1.7434 2.3852 2.4584 2.4377 1.6677 1.9813 1.9737 2.4111 3.0014 2.0438 1.6793 1.7282 1.8196 2.0979 1.7111 1.2861 1.2382 1.2364 1.4115 1.3143 1.1769 1.3903 1.3693 1.5470 1.4537 1.2823 1.2250 1.2462 1.3786 1.3535 1.0902 1.0582 1.0508 1.0889 1.0572 1.0462 1.0879 1.0726 1.0569 1.0582 9.6069 1.0693 1.0795 1.0364 1.0379 1.0819 1.0602 1.0634 1.0375 1.0613 1.0977 1.0994 1.0987 1.0988 1.1015 1.0992 1.1034 1.0885 1.0988 1.0956 1.1017
irintensity: 1.2435 0.5482 2.1680 0.6601 0.0524 1.6473 1.3366 3.0236 5.6701 0.6179 8.4147 0.3003 0.4934 2.3570 0.4285 2.8640 0.9719 0.5602 1.5934 1.8077 14.0968 2.1681 7.3109 4.5830 7.1087 4.2860 3.9397 138.1455 125.8511 2.9154 16.6042 69.6635 176.1113 24.9434 15.1045 11.7578 30.0195 49.6206 2.1843 95.9790 19.4533 161.7160 9.7091 32.6509 82.1917 107.4474 18.3351 4.3526 23.2845 92.0319 85.2237 117.1160 32.4684 5.9670 2.0277 2.6909 6.0590 0.4534 6.3259 3.4980 0.4528 11.4801 12.1056 1.0888 21.3999 52.8303 42.1935 1.6549 7.0475 23.0793 19.3062 11.7572 4.1364 1.2777 15.5975 7.0454 8.6467 25.1135 201.4734 11.9204 69.5541 31.4857 34.3490 17.6374 30.9857 20.3177 2.5463 22.0835 20.0974 32.4401 13.4427 86.3095 23.7460 49.6852 47.6009 13.1585 30.7039 9.3851 10.9638
temp: 298.150 k
press: 1.00000 atm
elementType: 8 8 8 8 6 6 6 6 6 6 6 6 6 6 6 1 1 1 1 1 1 1 1 1 1 1 1 1 1 1 1 1 1 1 1
symmnumber: 1
zpe: 781941.4 jmol-1
zpe.correction: 0.297826 hartree
zpe.thermalcorrener: 0.315190 hartree
zpe.thermalcorrenthalpy: 0.316134 hartree
zpe.thermalcorrgfe: 0.250132 hartree
zpe.sumelectzpe: -730.845239 hartree
zpe.sumelectthermal: -730.827874 hartree
zpe.sumelectthermalent: -730.826930 hartree
zpe.sumelectthermalfe: -730.892932 hartree
dipole: -0.4381 1.1374 2.8471
dipole: 3.0971
quadrupole: -88.8225 -89.5439 -91.9081
quadrupole: -7.8202 -5.5244 -6.7296
quadrupole: 1.2690 0.5476 -1.8166 -7.8202 -5.5244 -6.7296
hfenergy: -731.1430643 hartree
pointgroup: C01 [X(C11H20O4)]
dipole: -0.2290465 0.3892196 1.1316924 debye
polarizability: 146.2099889|2.8537591|136.849121|1.0394167|2.8801701|114.0383472 unknown
InChI: InChI=1S/C11H20O4/c1-8(2)7-13-10-5-4-6-11(15-10)14-9(3)12/h8,10-11H,4-7H2,1-3H3
charge 0 multiplicity 1
35 atoms
O  -0.501454 0.2319 -0.904406
O  1.55397 1.007095 -0.052149
O  -2.355893 -0.67589 0.336532
O  -2.666915 -2.50424 -1.096086
C  -0.384615 2.347875 0.423054
C  -1.922742 2.306869 0.591012
C  0.167246 0.932613 0.253254
C  -2.573887 1.56892 -0.600917
C  -1.935936 0.194131 -0.830372
C  2.245462 -0.3039 -0.092168
C  3.746586 -0.040373 -0.285134
C  4.338045 0.756876 0.898953
C  4.486391 -1.383441 -0.492063
C  -2.640831 -2.026132 0.057683
C  -2.899928 -2.780309 1.344465
H  -0.103871 2.932089 -0.473153
H  0.100014 2.817138 1.298286
H  -2.322985 3.33406 0.664642
H  -2.183903 1.786215 1.532404
H  -0.022311 0.29678 1.148393
H  -3.660309 1.440045 -0.450174
H  -2.427833 2.155516 -1.528454
H  -2.267049 -0.304924 -1.755437
H  1.831062 -0.901997 -0.925239
H  2.060566 -0.84347 0.864736
H  3.851767 0.567849 -1.205951
H  5.400635 1.002596 0.717432
H  4.28236 0.166048 1.834632
H  3.782817 1.698282 1.05135
H  5.565389 -1.210747 -0.656612
H  4.092869 -1.935322 -1.366145
H  4.383572 -2.034382 0.397968
H  -3.537379 -2.188813 2.021631
H  -1.941351 -2.962065 1.863624
H  -3.372558 -3.747591 1.119708
