program: Gaussian 09
title: 000239639
version: EM64L-G09RevD.01
frameworkgroup: C1[X(C13H10N2O4)]
method: RPBEPBE
basis: SDD
operation: Freq
keyword: #p
keyword: freq=noraman
keyword: PBEPBE/SDD
title: #p freq=noraman PBEPBE/SDD
converged: YES YES NO NO
title: Mulliken charges:
elementType: O O O O N N C C C C C C C C C C C C C H H H H H H H H H H
charge: -0.236630 -0.243547 -0.220036 -0.213371 0.048180 -0.572465 0.213767 0.312758 0.395974 -0.449164 -0.363539 -0.375180 -0.359742 0.275852 -0.311276 0.103133 -0.229543 -0.236311 -0.234975 0.250332 0.272012 0.232534 0.270429 0.293888 0.233744 0.231144 0.235504 0.329958 0.346571
chargesum: 0.00000
title: Mulliken charges with hydrogens summed into heavy atoms:
elementType: O O O O N N C C C C C C C C C C C C C
charge: -0.236630 -0.243547 -0.220036 -0.213371 0.048180 0.104064 0.213767 0.312758 0.395974 -0.198832 -0.091527 -0.142646 -0.089313 0.275852 -0.017387 0.103133 0.004201 -0.005167 0.000529
polarizability: 3.97810640e+02 -5.11817658e+00 1.75327171e+02 -8.25707379e-01 -2.85844277e+00 9.09685585e+01
1716.lowfreq: -6.2865 -1.1118 -0.0002 0.0003 0.0006 2.7877 23.8220 26.4774 43.3680
frequency: 23.7435 26.4179 43.3626 58.1062 63.2377 88.9257 114.9902 143.3396 153.1598 199.2988 221.5261 245.6780 306.4934 314.7212 365.7602 401.3738 417.2852 454.1373 476.1348 507.3278 542.2080 555.4417 562.2073 613.6047 620.9872 655.7847 672.6016 679.2357 695.0170 695.3284 724.4870 758.5827 762.1573 784.6910 803.2666 850.4813 879.4113 903.8146 913.6161 921.0467 930.8555 953.8575 980.4476 988.5483 1001.7761 1026.8598 1031.6971 1065.6976 1092.3500 1128.0709 1176.6728 1184.4702 1201.8391 1218.9214 1249.7808 1275.4047 1301.4176 1328.5829 1336.1555 1362.0202 1375.4334 1397.0351 1436.1507 1471.9430 1490.0726 1527.0342 1577.8796 1581.9200 1598.2777 1619.5694 1630.9226 3125.7199 3128.7165 3136.6584 3148.2712 3159.4621 3171.1275 3228.1707 3258.4495 3508.5606 3660.6710
redmass: 5.9657 7.6035 4.8717 7.5399 5.5323 6.0586 6.1724 8.1399 5.8420 5.9404 8.9433 4.3980 5.0894 6.4938 4.3444 2.8660 9.1253 2.1417 2.4375 3.8574 2.1732 3.2198 5.1424 6.0914 1.7196 4.6509 5.5379 5.1249 1.8111 5.1145 9.8288 3.7336 3.5820 2.7619 1.3606 1.2607 1.4458 1.3902 8.1170 6.0819 1.5213 4.3785 1.6153 3.7275 1.3300 1.3328 1.9649 1.8204 1.6309 4.3444 1.0613 2.0881 1.1374 5.0955 3.3409 2.7654 2.5780 1.4426 9.7322 4.9439 4.7746 3.0575 2.4488 3.6742 3.3032 6.1316 5.5692 2.5531 6.1341 5.6236 1.8940 1.0876 1.0862 1.0877 1.0930 1.0957 1.1010 1.0961 1.1030 1.0459 1.1033
irintensity: 6.0770 1.8540 0.4259 1.0117 13.4608 3.8338 0.1364 0.0103 2.1921 0.2384 1.2784 8.8663 3.3163 2.5309 2.6034 1.1096 2.2150 3.7449 11.0600 4.3162 30.2491 35.9905 1.9802 4.0398 171.2025 4.8159 8.3921 4.7770 52.0943 1.5925 18.5400 15.9869 8.6040 40.7002 64.0473 1.9513 39.5000 0.6768 10.7131 0.0565 3.9923 1.1930 1.5905 1.7158 0.0369 36.8827 3.6783 0.1828 9.0667 139.5576 0.1547 6.6213 32.8416 203.3639 282.5632 100.8621 63.4634 4.5334 57.5846 90.6146 12.1451 44.2381 15.2448 94.6225 153.4305 54.8187 6.5436 50.7626 92.9512 101.6940 254.8701 12.4630 1.5096 0.4694 19.7568 16.0073 34.4787 0.8063 4.8275 47.2508 29.8242
temp: 298.150 k
press: 1.00000 atm
elementType: 8 8 8 8 7 7 6 6 6 6 6 6 6 6 6 6 6 6 6 1 1 1 1 1 1 1 1 1 1
symmnumber: 1
zpe: 546014.3 jmol-1
zpe.correction: 0.207966 hartree
zpe.thermalcorrener: 0.224597 hartree
zpe.thermalcorrenthalpy: 0.225541 hartree
zpe.thermalcorrgfe: 0.160976 hartree
zpe.sumelectzpe: -910.337801 hartree
zpe.sumelectthermal: -910.321170 hartree
zpe.sumelectthermalent: -910.320226 hartree
zpe.sumelectthermalfe: -910.384791 hartree
dipole: 5.2476 4.8526 -2.6250
dipole: 7.6142
quadrupole: -119.8281 -98.6121 -111.6478
quadrupole: -10.4884 -4.3236 4.8609
quadrupole: -9.7988 11.4172 -1.6185 -10.4884 -4.3236 4.8609
hfenergy: -910.545767 hartree
pointgroup: C01 [X(C13H10N2O4)]
dipole: 2.1927955 -1.6539004 1.1959328 debye
polarizability: 395.9714811|8.969099|172.1376418|-21.2369721|-17.8204481|95.9972464 unknown
InChI: InChI=1S/C13H10N2O4/c14-13(16)11(9-4-2-1-3-5-9)8-10-6-7-12(19-10)15(17)18/h1-8H,14H2
charge 0 multiplicity 1
29 atoms
O  -1.953602 -0.131833 0.31575
O  0.308629 1.695562 -1.587669
O  -5.526874 -0.02697 0.542219
O  -3.958178 1.658426 0.640963
N  -4.3029 0.414905 0.522719
N  0.027101 2.088101 0.687848
C  1.036548 -0.037978 -0.056111
C  2.519343 -0.087212 -0.063837
C  -1.158073 -1.294076 0.190584
C  0.273068 -1.177355 0.112272
C  3.278223 0.906286 -0.749948
C  3.224386 -1.114214 0.633045
C  -2.002554 -2.421699 0.177937
C  -3.280252 -0.57205 0.368634
C  -3.350452 -1.961342 0.284834
C  0.402775 1.312396 -0.382248
C  4.686931 0.858917 -0.754869
C  4.632181 -1.157459 0.625414
C  5.372223 -0.172536 -0.071637
H  0.787129 -2.145286 0.155087
H  2.756644 1.691068 -1.306717
H  2.670729 -1.859364 1.215333
H  -1.672542 -3.454593 0.087076
H  -4.26428 -2.549134 0.301472
H  5.251108 1.624874 -1.297736
H  5.154261 -1.9491 1.174027
H  6.467145 -0.205106 -0.074351
H  0.021837 1.714759 1.635976
H  -0.472756 2.960114 0.505332
