program: Gaussian 09
title: 000239637
version: EM64L-G09RevD.01
frameworkgroup: C1[X(C12H10ClN)]
method: RPBEPBE
basis: SDD
operation: Freq
keyword: #p
keyword: freq=noraman
keyword: PBEPBE/SDD
title: #p freq=noraman PBEPBE/SDD
converged: YES YES NO NO
title: Mulliken charges:
elementType: Cl N C C C C C C C C C C C C H H H H H H H H H H
charge: -0.083169 -0.692325 0.224800 0.299566 0.288669 -0.344683 -0.431349 -0.401674 -0.403972 -0.135138 -0.216852 -0.225886 -0.226465 -0.241972 0.268450 0.274452 0.251405 0.218712 0.250574 0.228400 0.228263 0.231653 0.304018 0.334522
chargesum: 0.00000
title: Mulliken charges with hydrogens summed into heavy atoms:
elementType: Cl N C C C C C C C C C C C C
charge: -0.083169 -0.053786 0.224800 0.299566 0.288669 -0.076232 -0.156897 -0.150269 -0.185260 -0.135138 0.033722 0.002515 0.001798 -0.010319
polarizability: 2.15970771e+02 3.30985561e+00 1.50017355e+02 -4.32059037e+00 9.16607385e+00 7.63322568e+01
1716.lowfreq: -2.4129 0.0016 0.0021 0.0023 4.2565 5.1175 52.5917 77.8726 94.5830
frequency: 52.5679 77.8701 94.5824 124.3578 205.5759 250.8415 279.6580 315.5767 336.3733 361.3971 372.8669 401.1435 429.3439 447.1183 483.1913 524.9473 565.1921 614.9866 621.0989 634.7569 707.8105 719.0718 735.7445 773.7967 805.0125 833.3736 858.9677 882.1537 926.4083 929.5509 980.1744 987.3856 996.0602 1001.1840 1019.5958 1040.3197 1079.3176 1086.4653 1149.4382 1173.3970 1191.8232 1256.4902 1267.7948 1310.4948 1314.2663 1369.3380 1379.4182 1403.1995 1436.6133 1475.4832 1496.6656 1573.1888 1583.6529 1607.7594 1610.3611 1635.3079 3122.4791 3126.4091 3127.5334 3140.3402 3148.5341 3158.4397 3165.3270 3170.2505 3550.7442 3693.4941
redmass: 4.3036 5.1199 4.6205 6.3728 6.3020 5.1783 4.8368 5.7048 3.0085 4.8783 1.5502 2.2629 2.9685 1.1904 3.2341 3.4553 4.0785 6.4425 6.7617 7.2201 2.0666 2.7862 4.5935 2.0066 1.5895 5.7217 1.2478 1.3740 1.3751 1.3646 1.4339 5.1492 1.3410 5.1137 1.6964 1.7784 1.7651 1.9213 1.2049 1.0527 1.1153 2.5444 1.5747 2.2698 1.4183 5.3743 7.8933 3.8067 2.4519 2.5013 3.0577 6.1299 6.7146 4.8331 5.6468 1.2834 1.0849 1.0893 1.0873 1.0921 1.0965 1.0921 1.1016 1.0957 1.0451 1.1037
irintensity: 0.5100 1.2046 0.1207 0.3813 0.0964 3.2727 1.3006 1.7090 22.6016 18.1583 154.2636 1.6449 5.3836 82.9222 5.5232 0.8154 10.5659 1.6084 16.2829 31.1190 30.6748 21.0975 17.2197 27.9704 55.2753 9.4916 1.3955 11.7512 0.7065 1.3234 0.6949 0.6941 0.8726 8.3981 15.8303 3.0395 5.1182 15.9179 22.7817 0.0158 0.1383 2.3524 18.0433 18.2568 4.6036 4.8637 20.0821 30.2847 5.1129 127.8224 67.2897 2.5794 6.2075 0.8281 13.5836 176.1511 4.7878 18.7518 0.4205 12.3815 33.6203 1.0949 25.8088 5.3659 54.0769 35.7669
temp: 298.150 k
press: 1.00000 atm
elementType: 17 7 6 6 6 6 6 6 6 6 6 6 6 6 1 1 1 1 1 1 1 1 1 1
symmnumber: 1
zpe: 485648.5 jmol-1
zpe.correction: 0.184974 hartree
zpe.thermalcorrener: 0.196913 hartree
zpe.thermalcorrenthalpy: 0.197857 hartree
zpe.thermalcorrgfe: 0.146394 hartree
zpe.sumelectzpe: -977.127094 hartree
zpe.sumelectthermal: -977.115155 hartree
zpe.sumelectthermalent: -977.114211 hartree
zpe.sumelectthermalfe: -977.165674 hartree
dipole: -3.0726 2.9674 -0.7570
dipole: 4.3382
quadrupole: -85.6515 -75.9251 -91.4038
quadrupole: 5.8870 -1.4814 1.2076
quadrupole: -1.3247 8.4017 -7.0770 5.8870 -1.4814 1.2076
hfenergy: -977.312068 hartree
pointgroup: C01 [X(C12H10Cl1N1)]
dipole: -1.0252078 1.3396329 0.2595508 debye
dipolederiv: -0.4585775 0.3026312 0.0940259 0.4184257 -0.5441099 -0.137121 0.1316549 -0.133965 -0.1194934 -0.4815076 0.5997023 0.1535759 0.451253 -1.0481364 -0.1153272 0.1627818 -0.1712576 -0.6911828 0.0357814 -0.0833706 -0.0256882 0.3860635 -0.1907902 -0.0534653 0.075609 -0.0151613 -0.1027934 0.4830799 0.1175236 0.0148882 0.0398489 -0.049557 0.0143457 0.0603961 -0.0113687 0.0089319 0.2282528 -0.7353235 -0.1611931 -0.5982187 0.9635744 0.1908442 -0.0673363 0.2078488 0.1538914 0.0974159 0.1057854 0.0202285 -0.040209 -0.1074114 -0.0208657 -0.1051257 -0.0383938 -0.0919018 -0.2132061 -0.007532 0.0444739 -0.0053403 -0.1463633 0.0481742 0.0500363 0.0666592 0.0073556 -0.1861676 -0.0308548 -0.0768296 -0.0534085 -0.1294503 0.0534747 -0.1059542 0.0360315 0.0068723 -0.0307886 0.4264697 0.08894 -0.0245357 -0.0787378 0.0424007 -0.0439562 0.0379456 -0.2011768 0.2317582 -0.5305256 -0.159908 -0.7601762 0.5635414 0.213651 -0.1875968 0.2022838 -0.0496176 -0.1253248 0.0270015 0.0152069 0.3137369 0.0769025 0.0345828 0.0872419 0.0452433 -0.0843439 0.0357922 0.0147234 -0.0719758 0.0083476 -0.0976532 0.0833326 -0.1038923 0.0863214 0.0567818 0.0045555 0.0442692 0.0494733 0.0350067 -0.088265 0.1044452 0.0855005 0.1169572 0.0593613 0.0145664 0.0233468 -0.0061866 0.0267304 -0.1493087 0.0335551 -0.0139664 0.0214799 -0.106941 0.0952783 -0.0663277 -0.0175481 -0.0737175 0.0026484 -0.0279557 -0.0145397 -0.0364663 0.1345571 0.072007 -0.0442532 -0.0739036 -0.0251602 0.1005485 -0.0753684 -0.0791838 -0.0654912 0.0003182 0.0401881 0.0274859 0.0985963 0.0202902 0.1202296 -0.0528535 0.0915356 -0.0430722 0.0000254 0.0299238 -0.0341239 -0.0045048 -0.0766077 -0.1130303 -0.0692612 -0.0116053 -0.0655455 0.1473775 -0.0646175 -0.0181635 0.000111 -0.0107144 0.1119301 -0.013705 0.0038961 -0.0183086 0.1586994 -0.0031453 0.0148307 0.0915982 0.0265842 0.1218766 -0.0743178 0.117394 -0.0665923 -0.0330075 0.0237112 -0.0500026 -0.0610131 -0.0624116 0.0972995 -0.0988207 -0.086626 -0.1022529 -0.0289907 -0.1358407 -0.0467075 0.0058175 -0.0454762 0.1412283 -0.0313213 0.0039059 -0.0269826 0.1043086 0.111469 -0.0486935 -0.0078646 -0.03147 0.2027418 -0.02373 -0.0042995 0.0128386 0.3679399 0.1953963 -0.0078915 -0.0103202 0.0811589 0.2402923 -0.0246933 -0.04587 -0.0387511 0.3030284 unknown
polarizability: 215.1159254|-3.2844179|133.0597565|-9.1322986|32.9478068|94.1447013 unknown
InChI: InChI=1S/C12H10ClN/c13-10-6-7-12(14)11(8-10)9-4-2-1-3-5-9/h1-8H,14H2
charge 0 multiplicity 1
24 atoms
Cl 3.706905 -2.228825 -0.813824
N  0.220954 2.526596 0.555739
C  0.406012 0.134875 -0.043804
C  -1.073908 -0.073159 -0.04518
C  1.002358 1.403965 0.27433
C  1.254145 -0.950831 -0.383758
C  -1.883939 0.324576 1.056877
C  -1.706499 -0.724323 -1.140608
C  2.422884 1.521478 0.273025
C  2.649595 -0.798144 -0.384227
C  3.251169 0.429904 -0.05018
C  -3.276095 0.086844 1.056845
C  -3.097963 -0.962674 -1.140239
C  -3.891446 -0.554685 -0.042982
H  0.809744 -1.92351 -0.615726
H  -1.412887 0.779772 1.935801
H  -1.101853 -1.025935 -2.003608
H  2.881353 2.48704 0.518097
H  4.339657 0.536834 -0.045767
H  -3.877267 0.390359 1.921505
H  -3.563221 -1.462056 -1.997545
H  -4.97139 -0.738576 -0.04261
H  0.66178 3.430498 0.699385
H  -0.790587 2.490875 0.460456
