program: Gaussian 09
title: 000239635
version: EM64L-G09RevD.01
frameworkgroup: C1[X(C10H21NO2)]
method: RPBEPBE
basis: SDD
operation: Freq
keyword: #p
keyword: freq=noraman
keyword: PBEPBE/SDD
title: #p freq=noraman PBEPBE/SDD
converged: YES YES NO NO
title: Mulliken charges:
elementType: O O N C C C C C C C C C C H H H H H H H H H H H H H H H H H H H H H
charge: -0.310089 -0.295659 -0.367249 -0.362916 -0.377156 -0.351675 -0.355835 -0.355077 -0.413485 -0.695363 0.299240 -0.254651 -0.663430 0.193254 0.187417 0.186785 0.195733 0.186350 0.187449 0.220045 0.197491 0.196020 0.194926 0.254085 0.211221 0.209895 0.216125 0.209442 0.320865 0.216923 0.234818 0.212353 0.221766 0.250384
chargesum: 0.00000
title: Mulliken charges with hydrogens summed into heavy atoms:
elementType: O O N C C C C C C C C C C
charge: -0.310089 -0.295659 -0.046384 0.017755 0.005362 0.022123 0.061701 0.035869 0.051821 -0.059903 0.299240 0.197091 0.021073
polarizability: 1.49938404e+02 6.95429522e+00 1.17280867e+02 4.66490858e+00 -2.45460611e+00 1.04923641e+02
1716.lowfreq: -10.1988 -0.0007 -0.0006 -0.0004 5.3078 11.5580 14.0611 35.7727 45.4639
frequency: 11.8196 35.5159 45.0813 57.8258 68.1303 85.5600 94.8614 110.8755 129.6132 150.0865 176.5059 216.1560 237.8448 250.4261 264.8947 324.4946 355.5394 393.0826 424.0740 489.9279 521.9645 559.8621 627.0798 697.7442 722.3666 734.7028 773.8181 794.3677 817.1371 848.4368 880.3104 898.6462 916.9658 957.8806 998.3874 1010.2881 1035.4556 1058.1266 1069.9806 1082.0783 1095.8017 1113.2887 1127.0564 1139.0211 1155.3308 1194.1891 1197.1983 1227.3908 1244.4191 1270.9717 1280.5639 1283.7217 1288.2904 1295.2957 1303.1806 1336.8978 1352.4423 1354.4714 1357.8756 1369.7407 1389.3768 1393.4602 1454.4223 1455.4045 1457.1114 1462.0575 1462.7413 1465.0300 1473.0782 1479.3416 1481.5885 1483.3555 1488.1383 1492.7544 1668.2203 2948.9372 2952.1519 2959.3701 2968.6684 2972.8188 2974.1459 2985.8389 2989.8161 2990.6232 2996.3077 3015.1568 3025.0678 3033.3243 3045.8127 3069.0053 3071.8217 3074.5176 3084.3173 3088.4307 3114.8808 3577.5177
redmass: 3.9417 3.8361 1.5677 3.6723 3.7112 2.9535 3.4006 1.7561 3.1453 2.1537 2.3701 1.6224 1.1122 2.9241 1.9554 3.1378 3.7690 2.8203 2.8309 2.8897 2.2070 1.2549 4.3153 9.5003 1.0725 1.1619 1.3962 1.3871 1.7449 1.6770 2.2464 1.5639 2.2672 1.9084 1.5927 2.7262 2.9641 2.6548 2.5325 2.0958 2.1384 2.9689 3.4516 1.8058 1.6829 1.6669 1.9082 1.3746 1.3215 1.2928 1.1084 1.1096 1.1250 1.1032 1.2251 1.3921 1.5189 1.5322 1.2754 1.3349 1.2371 1.2167 1.0883 1.0857 1.1068 1.0650 1.0486 1.0777 1.0784 1.0419 1.0849 1.0788 1.0900 1.7014 8.5639 1.0585 1.0587 1.0592 1.0587 1.0368 1.0618 1.0951 1.0373 1.0666 1.0974 1.1022 1.0594 1.1032 1.1019 1.1007 1.0992 1.0996 1.0977 1.1031 1.1053 1.0772
irintensity: 0.8882 1.9825 0.0955 2.5346 5.9793 1.0816 0.2377 0.0396 0.0292 0.1766 1.9286 3.8102 0.0022 0.1570 2.2584 19.4737 5.8120 2.6355 3.3146 2.1300 13.8371 134.1601 8.7866 19.7287 13.8910 1.1990 6.9941 10.1840 1.0539 4.0532 1.3145 11.4777 5.3012 21.6440 1.6151 11.9305 124.9787 10.4405 9.4399 2.4227 29.9703 45.2228 62.7054 10.9041 34.5620 43.5429 123.9221 34.3031 8.6484 35.2202 0.2249 4.8108 0.9855 0.1293 30.0619 4.4915 0.0499 2.3657 2.1489 3.4497 26.5957 11.2794 15.9002 7.9704 22.7570 2.1226 8.3072 1.0115 4.1761 12.2059 6.9671 9.3214 29.6424 299.1519 285.5624 6.8924 0.8370 24.2614 84.6946 37.2785 64.4172 5.5921 32.2742 25.1128 1.9450 0.3802 39.6107 21.6172 139.8203 94.6631 53.8031 12.0203 39.2182 3.6787 36.7898 28.3615
temp: 298.150 k
press: 1.00000 atm
elementType: 8 8 7 6 6 6 6 6 6 6 6 6 6 1 1 1 1 1 1 1 1 1 1 1 1 1 1 1 1 1 1 1 1 1
symmnumber: 1
zpe: 789294.1 jmol-1
zpe.correction: 0.300626 hartree
zpe.thermalcorrener: 0.317348 hartree
zpe.thermalcorrenthalpy: 0.318292 hartree
zpe.thermalcorrgfe: 0.253011 hartree
zpe.sumelectzpe: -597.799441 hartree
zpe.sumelectthermal: -597.782719 hartree
zpe.sumelectthermalent: -597.781775 hartree
zpe.sumelectthermalfe: -597.847056 hartree
dipole: -1.6270 0.7252 -1.4773
dipole: 2.3142
quadrupole: -83.0655 -78.8317 -83.5368
quadrupole: 8.9376 -4.1364 2.9750
quadrupole: -1.2542 2.9797 -1.7255 8.9376 -4.1364 2.9750
hfenergy: -598.1000671 hartree
pointgroup: C01 [X(C10H21N1O2)]
dipole: 0.6322 -0.2935598 -0.5857319 debye
polarizability: 150.4117134|5.9088194|116.7134207|-4.2650189|2.9108178|105.0177774 unknown
InChI: InChI=1S/C10H21NO2/c1-3-5-6-7-8-9-11-10(12)13-4-2/h11H,3-9H2,1-2H3
charge 0 multiplicity 1
34 atoms
O  -3.281133 -0.541673 -0.993047
O  -3.243142 0.959325 0.835713
N  -1.576946 0.952439 -0.824938
C  2.739328 0.285618 0.477136
C  1.502758 0.753527 -0.323868
C  3.77707 -0.471705 -0.381156
C  0.473706 1.509762 0.544667
C  5.012802 -0.935614 0.423894
C  -0.755906 2.0248 -0.240541
C  6.047627 -1.688759 -0.43944
C  -2.731099 0.507674 -0.222963
C  -4.530383 -1.14194 -0.450114
C  -4.216346 -2.230599 0.580614
H  2.407124 -0.366425 1.311742
H  3.225008 1.166765 0.946714
H  1.834236 1.408548 -1.15785
H  1.020166 -0.131671 -0.788289
H  4.109856 0.179334 -1.216855
H  3.294245 -1.355252 -0.849282
H  0.122289 0.857764 1.368137
H  0.96605 2.384271 1.018035
H  4.680022 -1.587479 1.257343
H  5.492956 -0.052728 0.893594
H  -1.414436 2.600838 0.432395
H  -0.426354 2.698907 -1.055488
H  5.601824 -2.594191 -0.893056
H  6.921207 -2.006435 0.159087
H  6.417077 -1.049184 -1.263361
H  -1.278559 0.478851 -1.677561
H  -5.032659 -1.550199 -1.342334
H  -5.142677 -0.338187 -0.004214
H  -5.15251 -2.720337 0.908522
H  -3.555294 -3.002637 0.14951
H  -3.727308 -1.792909 1.467154
