program: Gaussian 09
title: 000239630
version: EM64L-G09RevD.01
frameworkgroup: C1[X(C17H19N7O3)]
method: RPBEPBE
basis: SDD
operation: Freq
keyword: #p
keyword: freq=noraman
keyword: PBEPBE/SDD
title: #p freq=noraman PBEPBE/SDD
converged: YES YES NO NO
title: Mulliken charges:
elementType: O O O N N N N N N N C C C C C C C C C C C C C C C C C H H H H H H H H H H H H H H H H H H H
charge: -0.295729 -0.273342 -0.252587 -0.197697 -0.161243 -0.221566 -0.139778 -0.357089 0.021704 -0.437785 0.172313 0.120901 0.169863 0.160443 0.203809 -0.631127 -0.617204 -0.602412 0.484342 -0.409010 0.491525 -0.391654 -0.359685 -0.353603 -0.442188 0.214793 -0.798430 0.242720 0.291078 0.242470 0.272329 0.244363 0.244251 0.268586 0.248237 0.248158 0.309725 0.214599 0.225829 0.257712 0.311649 0.220561 0.311828 0.238202 0.271385 0.238757
chargesum: 0.00000
title: Mulliken charges with hydrogens summed into heavy atoms:
elementType: O O O N N N N N N N C C C C C C C C C C C C C C C C C
charge: -0.295729 -0.273342 -0.252587 -0.197697 -0.161243 -0.221566 -0.139778 -0.047364 0.021704 -0.125957 0.172313 0.120901 0.169863 0.160443 0.203809 0.145141 0.143739 0.162568 0.484342 -0.194411 0.491525 -0.165826 -0.101973 -0.041954 -0.221627 0.214793 -0.050086
polarizability: 6.28535801e+02 -1.18882111e+00 2.56602194e+02 -1.31039206e-01 2.34871362e-01 1.12205701e+02
1716.lowfreq: -71.2560 -4.1652 -1.0982 -0.0012 -0.0001 0.0009 2.3379 14.8455 21.7800
frequency: -71.2554 14.5990 21.7066 25.3899 44.2034 72.6403 80.7813 88.1296 98.7044 110.7526 112.9887 117.5870 129.2806 133.9862 143.2112 180.4419 201.8198 207.8184 223.1486 235.5316 244.2667 257.9030 289.4849 310.2117 315.5415 330.5897 351.0012 362.8223 378.4723 389.7994 390.8610 417.3133 418.0315 428.6925 473.1393 505.4223 532.1359 538.4782 562.2431 581.9929 624.7914 629.3380 641.8848 651.2090 656.8713 686.4865 698.9408 702.5885 709.3762 730.7702 740.9730 779.7376 782.5181 824.2977 836.8975 855.6548 882.2729 926.1576 929.6373 953.3564 958.8601 969.5949 984.2042 992.7618 1005.0993 1030.4017 1031.3836 1051.8779 1102.5952 1127.5599 1129.5353 1132.4167 1133.8898 1179.0573 1185.1318 1196.1787 1219.7784 1226.7216 1229.2762 1245.1022 1265.0195 1268.4942 1298.6435 1302.8256 1317.0057 1351.8139 1375.2093 1376.9205 1395.0878 1413.2561 1423.5522 1427.0601 1441.2734 1448.3163 1461.3921 1467.9433 1474.2517 1477.6220 1480.6278 1480.8093 1486.7862 1492.9305 1494.8086 1508.3458 1521.1568 1556.2263 1564.9304 1588.8273 1601.0890 1622.2897 1626.9141 1636.0379 1644.8455 2985.9077 2988.0443 3005.3096 3008.1530 3010.5932 3072.8340 3093.9145 3101.8277 3110.3377 3112.2206 3120.2763 3125.2227 3136.9432 3137.1182 3137.4601 3164.3559 3197.8817 3407.0099 3518.7498
redmass: 1.0567 5.6339 4.6963 6.0597 5.0295 4.5291 4.4017 3.7581 5.9199 1.2183 2.6025 1.2332 2.7467 6.7446 5.1794 1.0998 4.8608 3.1928 6.3003 4.5222 4.1956 5.8106 3.0414 4.3190 6.4747 3.8739 4.6403 4.3153 8.3073 9.1045 3.9544 3.1859 6.4503 6.2939 5.8607 6.5928 2.4509 5.1847 5.7656 2.9258 1.6211 6.9115 3.2295 1.1780 6.2009 11.3786 7.3413 11.3110 7.1190 11.1105 3.6353 5.1192 5.1728 4.7304 1.3778 1.4299 4.3852 1.5245 6.3966 2.8283 5.1955 1.3796 1.7028 1.3407 2.5490 1.6649 2.7928 3.0536 3.4987 1.5566 1.3026 1.2971 1.2907 3.0416 1.1514 2.8240 3.2926 3.3357 2.9979 1.7875 2.0155 5.8085 5.8119 2.4789 1.6251 3.7324 2.1883 1.4693 2.7351 1.2746 3.8057 1.2707 1.3768 1.1851 1.8480 1.0469 1.0434 1.0779 1.0812 1.0722 1.0450 1.8185 1.7543 3.0503 2.2220 6.5651 5.0088 5.2684 6.5354 6.0572 8.1031 5.3649 9.4798 1.0870 1.0384 1.0336 1.0326 1.0328 1.0983 1.1025 1.1021 1.1024 1.0897 1.1046 1.0908 1.0979 1.1022 1.1010 1.0943 1.0945 1.0747 1.0764
irintensity: 0.0706 0.1037 3.0264 1.3473 0.3600 10.2174 0.9379 0.4598 3.9992 0.4718 1.9265 0.6700 16.1298 2.2409 0.0105 1.8835 0.6405 15.3076 0.2099 6.8846 7.7599 1.0369 1.8027 16.5874 0.1117 6.6257 3.7408 11.5986 0.1721 31.4484 0.6898 0.1017 6.7273 4.1602 67.8919 15.5964 30.1292 2.1822 8.4869 0.9222 42.5054 0.1220 45.5968 72.8018 13.7734 3.4926 0.3338 7.5785 8.5084 16.0296 1.2814 0.5905 2.4481 0.2037 26.2669 35.9526 4.2380 57.6040 10.6459 1.4433 76.8646 0.1895 60.8132 0.8131 6.5943 8.2179 184.7257 10.4632 250.4962 82.6510 0.3002 0.2082 0.3388 39.4627 36.9680 0.7855 102.2679 59.5590 5.0971 2.8705 72.3963 51.2149 19.3705 229.3572 31.7310 285.7788 36.8409 118.5298 2.6729 5.4999 80.4512 38.2897 52.8142 91.3257 227.5195 20.3706 15.8266 1.7001 17.5631 19.9328 17.7378 643.5237 24.6281 315.4120 113.1346 586.9698 137.1709 15.3601 959.0851 151.8918 205.6274 117.0833 466.5323 53.5656 7.9142 41.9996 43.5910 38.0747 14.4839 19.3303 18.5763 16.3277 26.2151 0.2820 12.2184 8.3088 0.9487 0.6677 4.6683 4.1269 9.2939 12.3034
temp: 298.150 k
press: 1.00000 atm
elementType: 8 8 8 7 7 7 7 7 7 7 6 6 6 6 6 6 6 6 6 6 6 6 6 6 6 6 6 1 1 1 1 1 1 1 1 1 1 1 1 1 1 1 1 1 1 1
symmnumber: 1
zpe: 929634.7 jmol-1
zpe.correction: 0.354079 hartree
zpe.thermalcorrener: 0.379368 hartree
zpe.thermalcorrenthalpy: 0.380312 hartree
zpe.thermalcorrgfe: 0.296637 hartree
zpe.sumelectzpe: -1266.228973 hartree
zpe.sumelectthermal: -1266.203684 hartree
zpe.sumelectthermalent: -1266.202740 hartree
zpe.sumelectthermalfe: -1266.286415 hartree
dipole: 5.8186 0.9140 0.0292
dipole: 5.8900
quadrupole: -184.2075 -146.0664 -160.2749
quadrupole: 34.9670 0.3651 0.1267
quadrupole: -20.6912 17.4498 3.2414 34.9670 0.3651 0.1267
hfenergy: -1266.5830523 hartree
pointgroup: C01 [X(C17H19N7O3)]
dipole: 2.2651614 -0.109322 0.476443 debye
polarizability: 626.5372641|-24.2779396|113.4267926|17.9620365|2.4560641|257.3796392 unknown
InChI: InChI=1S/C17H19N7O3/c1-10(25)19-12-7-5-11(6-8-12)9-18-21-16-20-14-13(22(16)2)15(26)24(4)17(27)23(14)3/h5-9,19,21H,1-4H3
charge 0 multiplicity 1
46 atoms
O  -4.155686 0.339859 2.527718
O  -7.478495 0.398475 -0.820801
O  8.438287 -0.3432 -0.476686
N  -2.093377 0.178661 0.164038
N  -5.2437 0.277346 -1.528449
N  -5.8008 0.367157 0.817206
N  -2.830303 0.152298 -2.018045
N  -0.476831 0.051259 -1.710408
N  0.663607 0.014068 -0.938147
N  6.825066 -0.238019 1.227869
C  -3.509876 0.245927 0.187654
C  -3.909772 0.226857 -1.158568
C  -4.433357 0.318331 1.283818
C  -1.750006 0.124848 -1.176548
C  -6.247854 0.350414 -0.531254
C  -1.234724 0.174113 1.367238
C  -5.627785 0.255739 -2.95224
C  -6.8708 0.444849 1.837798
C  3.090819 -0.099515 -0.847691
C  1.821779 -0.054442 -1.571633
C  5.611791 -0.192631 0.490436
C  4.311379 -0.168311 -1.57493
C  3.158115 -0.077302 0.576539
C  5.560893 -0.21454 -0.929799
C  4.395378 -0.12302 1.231694
C  8.141586 -0.31033 0.751884
C  9.192791 -0.348221 1.861066
H  -0.54531 1.032773 1.349672
H  -1.90208 0.238475 2.240781
H  -0.639791 -0.751805 1.410993
H  -6.725487 0.300895 -2.999339
H  -5.262762 -0.669424 -3.429138
H  -5.187543 1.120349 -3.476972
H  -6.381526 0.448146 2.822661
H  -7.547586 -0.420163 1.743718
H  -7.463403 1.363465 1.695917
H  -0.446095 0.024305 -2.740159
H  1.875882 -0.080141 -2.67818
H  4.283289 -0.185965 -2.671705
H  2.22802 -0.024413 1.150564
H  6.491152 -0.267009 -1.497137
H  4.428164 -0.105628 2.32914
H  6.718434 -0.217085 2.245446
H  9.142958 0.556017 2.495874
H  10.188097 -0.398685 1.397402
H  9.059759 -1.232775 2.511403
