program: Gaussian 09
title: 000239629
version: EM64L-G09RevD.01
frameworkgroup: C1[X(C16H16N6O4)]
method: RPBEPBE
basis: SDD
operation: Freq
keyword: #p
keyword: freq=noraman
keyword: PBEPBE/SDD
title: #p freq=noraman PBEPBE/SDD
converged: YES YES NO NO
title: Mulliken charges:
elementType: O O O O N N N N N N C C C C C C C C C C C C C C C C H H H H H H H H H H H H H H H H
charge: -0.294157 -0.273495 -0.264404 -0.256620 -0.197312 -0.161428 -0.221776 -0.140806 -0.357463 0.021682 0.172462 0.120761 0.170126 0.160906 0.203884 -0.630008 -0.617345 -0.602371 0.514214 0.219243 0.174595 -0.486051 -0.408972 -0.390530 -0.329593 -0.201975 0.243333 0.291698 0.243305 0.244021 0.272380 0.244107 0.268903 0.248270 0.248005 0.309164 0.279800 0.229149 0.214930 0.255123 0.242003 0.242244
chargesum: 0.00000
title: Mulliken charges with hydrogens summed into heavy atoms:
elementType: O O O O N N N N N N C C C C C C C C C C C C C C C C
charge: -0.294157 -0.273495 -0.264404 -0.256620 -0.197312 -0.161428 -0.221776 -0.140806 -0.048299 0.021682 0.172462 0.120761 0.170126 0.160906 0.203884 0.148327 0.143163 0.162807 0.514214 0.219243 0.174595 -0.206252 -0.194042 -0.161381 -0.074470 0.282273
polarizability: 5.31608945e+02 -3.79046098e+00 2.54174279e+02 3.53522035e-02 7.63988476e-04 1.04721714e+02
1716.lowfreq: -24.0439 -3.7888 -3.5314 -0.0008 -0.0004 0.0008 2.5746 14.4687 26.1901
frequency: -23.9771 14.4053 26.1842 26.4478 64.2626 84.9510 99.7318 106.8058 109.2180 112.8465 128.1759 135.2604 181.5739 182.7215 203.0973 207.6895 230.5998 234.7028 248.4053 260.5772 295.1246 310.3508 315.1805 350.6623 361.9825 378.7941 380.7037 386.8922 411.9535 433.6838 433.8312 478.5697 500.9979 538.0897 574.6464 608.6974 609.2069 625.2917 641.4460 680.0292 686.5093 695.7813 702.6048 707.5828 720.6841 730.8123 760.0059 779.5801 783.3493 808.9180 831.4091 844.5906 888.5959 915.4808 935.6870 939.2287 954.5992 958.7361 978.9265 1030.7733 1050.8628 1061.4604 1064.9973 1101.7474 1120.2674 1129.7849 1132.1426 1132.6163 1139.3917 1177.5597 1193.0405 1195.8623 1228.4226 1229.5460 1256.3932 1262.1576 1269.5916 1298.5375 1306.6290 1356.0667 1366.9842 1387.4959 1398.8791 1412.4656 1426.4533 1440.3506 1457.9192 1461.3923 1473.9247 1476.3579 1477.9754 1479.9595 1481.0059 1486.5148 1486.7551 1494.8043 1520.8550 1556.3691 1565.0575 1601.1182 1605.9395 1623.3401 1627.1642 1645.1321 2989.9702 3005.1114 3008.8539 3010.8233 3018.0102 3093.6870 3097.5798 3102.0211 3111.1982 3121.1148 3137.3194 3137.4979 3137.8135 3185.0207 3191.5231 3407.9034
redmass: 2.3540 5.8361 5.2783 6.9473 5.5322 4.0205 4.8608 6.4883 1.0664 1.1249 2.9314 5.8776 1.1282 6.2865 3.5333 5.1264 5.8362 4.6966 4.9948 6.2431 2.9511 3.9721 6.5295 3.9859 4.8540 8.0782 6.1298 10.1874 5.7567 6.5303 3.2573 5.8103 8.6973 5.5321 6.5250 7.5885 3.1937 1.7736 3.4673 9.6615 11.3942 8.5146 11.3112 6.9417 4.1850 11.1241 6.4915 5.5811 5.7145 1.3489 5.6910 8.8049 1.3885 1.4493 3.4592 1.4528 2.8697 5.4218 4.1732 2.7760 3.0733 3.8546 1.4560 3.8664 1.0366 1.3016 1.2979 1.2919 1.5837 2.8091 1.9882 2.7407 2.9720 3.6130 1.5520 2.9923 5.1007 6.0741 2.3432 2.6363 1.4292 3.3939 2.8193 1.2801 1.2562 1.3842 4.0373 1.8775 1.0436 2.1664 1.1738 1.0441 1.1536 1.0443 1.2457 1.6947 2.2548 6.1723 6.2715 6.5988 7.6928 8.3102 8.3557 9.5293 1.0871 1.0336 1.0326 1.0328 1.0534 1.1025 1.1191 1.1021 1.1025 1.1046 1.1022 1.1010 1.0900 1.0953 1.0932 1.0747
irintensity: 15.7704 0.3148 0.1783 0.4074 0.0706 1.1911 0.1213 0.4895 0.6920 1.5925 16.5013 0.5248 2.1970 5.4495 10.9054 2.2333 0.5465 6.9745 4.0358 4.7664 0.5978 6.8949 0.1442 10.8779 0.4300 0.4057 4.6709 33.7644 18.1056 4.4837 4.7279 41.7886 47.7497 0.9217 4.3118 1.0636 0.3763 53.0960 49.2113 0.3303 3.3309 0.0622 7.5415 7.5868 2.6587 16.6293 8.9955 0.1824 13.0640 35.0011 22.9614 3.1493 5.7176 45.1109 18.4642 13.7923 4.1066 71.9494 158.8336 176.4842 11.8747 9.9106 4.3064 279.0184 0.0049 0.3561 0.2186 0.2143 16.1270 49.2691 62.0156 3.3047 64.6572 13.3736 60.2801 201.9661 117.4559 24.3132 162.5014 26.4279 0.0258 19.2211 29.4354 7.8038 51.3786 79.9482 125.6482 198.8357 15.8631 178.1324 35.8379 17.3987 24.9452 17.9445 27.6867 194.2967 110.0653 484.6915 41.6383 977.9011 33.5380 41.6485 146.9676 489.3954 48.7911 41.7991 46.4733 36.0594 139.3332 19.4602 29.0309 18.6698 15.8862 0.2466 0.9650 0.6518 9.7172 7.9761 2.2944 8.8500
temp: 298.150 k
press: 1.00000 atm
elementType: 8 8 8 8 7 7 7 7 7 7 6 6 6 6 6 6 6 6 6 6 6 6 6 6 6 6 1 1 1 1 1 1 1 1 1 1 1 1 1 1 1 1
symmnumber: 1
zpe: 825688.8 jmol-1
zpe.correction: 0.314488 hartree
zpe.thermalcorrener: 0.337397 hartree
zpe.thermalcorrenthalpy: 0.338341 hartree
zpe.thermalcorrgfe: 0.260415 hartree
zpe.sumelectzpe: -1246.826116 hartree
zpe.sumelectthermal: -1246.803207 hartree
zpe.sumelectthermalent: -1246.802263 hartree
zpe.sumelectthermalfe: -1246.880189 hartree
dipole: 6.4635 -2.8159 0.0097
dipole: 7.0502
quadrupole: -160.0153 -140.1058 -151.7713
quadrupole: 7.2014 0.0771 0.0044
quadrupole: -9.3845 10.5250 -1.1405 7.2014 0.0771 0.0044
hfenergy: -1247.1406041 hartree
pointgroup: C01 [X(C16H16N6O4)]
dipole: 2.6462037 -0.3534588 -0.7526439 debye
polarizability: 521.3131233|-50.9002227|111.0537173|33.8435061|-0.0110185|258.1380971 unknown
InChI: InChI=1S/C16H16N6O4/c1-20-12-13(21(2)16(24)22(3)14(12)23)18-15(20)19-17-7-9-4-5-10-11(6-9)26-8-25-10/h4-7,19H,8H2,1-3H3
charge 0 multiplicity 1
42 atoms
O  -3.673375 0.428644 2.392951
O  -6.81815 0.722692 -1.110793
O  5.071146 -0.643154 2.871344
O  7.149431 -0.931917 1.699769
N  -1.518031 0.100136 0.131394
N  -4.567717 0.429361 -1.710475
N  -5.227487 0.573625 0.6055
N  -2.150049 0.118904 -2.083519
N  0.171312 -0.159935 -1.664229
N  1.268309 -0.274432 -0.839476
C  -2.92469 0.276245 0.08677
C  -3.260603 0.280242 -1.276908
C  -3.891522 0.42303 1.137453
C  -1.116575 0.013839 -1.190991
C  -5.60984 0.583421 -0.762598
C  -0.720579 0.03599 1.374877
C  -4.884263 0.428092 -3.150941
C  -6.336128 0.736363 1.573556
C  3.671469 -0.568029 -0.625478
C  4.851232 -0.655811 1.472405
C  6.078174 -0.826386 0.785742
C  3.638455 -0.524147 0.808267
C  2.446873 -0.437392 -1.414734
C  4.910212 -0.740232 -1.306383
C  6.138537 -0.87272 -0.608789
C  6.535062 -0.823629 3.053617
H  0.027364 0.844167 1.393368
H  -1.422512 0.148076 2.215768
H  -0.195564 -0.929623 1.444905
H  -4.357099 1.254985 -3.656022
H  -5.972161 0.553642 -3.250641
H  -4.566185 -0.524137 -3.607809
H  -5.896547 0.701288 2.580982
H  -7.073979 -0.072207 1.443554
H  -6.846629 1.699074 1.406673
H  0.247164 -0.197769 -2.691207
H  2.692364 -0.391937 1.33693
H  4.918149 -0.771437 -2.401928
H  2.554923 -0.481403 -2.516346
H  7.087336 -1.004544 -1.133944
H  6.717613 -1.762156 3.60424
H  6.947961 0.063585 3.56284
