program: Gaussian 09
title: 000239628
version: EM64L-G09RevD.01
frameworkgroup: C1[X(C15H15BrN6O2)]
method: RPBEPBE
basis: SDD
operation: Freq
keyword: #p
keyword: freq=noraman
keyword: PBEPBE/SDD
title: #p freq=noraman PBEPBE/SDD
converged: YES YES NO NO
title: Mulliken charges:
elementType: Br O O N N N N N N C C C C C C C C C C C C C C C H H H H H H H H H H H H H H H
charge: 0.021905 -0.292138 -0.270801 -0.196148 -0.161520 -0.221755 -0.138690 -0.356950 0.029151 0.172661 0.121978 0.171185 0.162256 0.204870 -0.630264 -0.616789 -0.601646 -0.399195 0.468798 -0.374396 -0.359333 -0.182347 -0.176135 -0.212040 0.243248 0.293002 0.243320 0.244536 0.273150 0.244610 0.269085 0.249215 0.249025 0.311597 0.214078 0.231535 0.263308 0.254289 0.253347
chargesum: 0.00000
title: Mulliken charges with hydrogens summed into heavy atoms:
elementType: Br O O N N N N N N C C C C C C C C C C C C C C C
charge: 0.021905 -0.292138 -0.270801 -0.196148 -0.161520 -0.221755 -0.138690 -0.045353 0.029151 0.172661 0.121978 0.171185 0.162256 0.204870 0.149305 0.145507 0.165679 -0.185117 0.468798 -0.142861 -0.096025 0.071942 0.077212 -0.212040
polarizability: 5.63974488e+02 5.16411352e+00 2.36870760e+02 2.12411463e-01 2.67660788e-01 9.68943707e+01
1716.lowfreq: -4.3516 -0.0004 0.0003 0.0007 0.7218 1.7892 13.9694 24.9756 29.8453
frequency: 13.9684 24.9575 29.8394 52.4944 83.9659 92.7296 104.4481 109.6965 112.5917 127.6749 128.6726 151.8358 179.4180 184.6264 212.5388 218.1627 243.6563 250.7811 255.5318 282.8226 315.2846 319.4759 336.2801 349.6585 359.5173 379.7904 389.1981 409.4489 416.7107 436.3567 476.7817 512.9479 526.1155 545.1253 623.0529 631.6478 647.3272 650.0867 686.6844 698.2947 703.0149 711.2263 717.4619 731.7899 779.9780 791.7440 825.1324 841.1231 878.5601 919.4418 952.1370 958.8845 962.4294 980.8181 992.8282 1031.2512 1051.0721 1058.5709 1102.7820 1123.9742 1129.6933 1132.1954 1133.1551 1178.3617 1183.5582 1195.3308 1225.6501 1228.9976 1243.9520 1268.3796 1293.7670 1298.3628 1307.9948 1352.5927 1376.3931 1394.5319 1399.1753 1413.1351 1426.7607 1440.1330 1461.3439 1472.4129 1473.8748 1477.5681 1480.3655 1480.4286 1486.9154 1494.8347 1521.5800 1552.8750 1555.9587 1581.6764 1593.5087 1602.7853 1625.4273 1644.6712 2989.8839 3005.7663 3008.4189 3011.6167 3094.7418 3103.2352 3110.7865 3120.8347 3128.6037 3137.9356 3138.0407 3155.3984 3172.3094 3176.1720 3403.7455
redmass: 6.7053 9.0123 3.8610 6.4593 4.3618 4.0798 7.4371 1.0694 1.1638 3.7495 3.4655 9.4089 1.7559 1.8980 3.8152 6.0434 4.1881 6.6152 4.2332 3.5465 6.5330 4.0521 4.8885 4.7831 3.9426 8.0979 9.3465 2.9272 6.7118 7.6651 6.3589 2.7500 7.4258 5.8317 7.1209 2.7502 1.7911 7.4979 11.0801 7.5242 11.2360 7.0218 3.4589 11.1282 5.4050 5.3519 1.3341 1.3781 4.1729 1.4920 2.8198 5.1984 1.4056 1.3620 4.6666 2.7552 3.0447 2.6322 2.0700 2.3073 1.3022 1.2980 1.2921 3.0748 1.1206 2.8963 3.6079 2.8097 2.0486 6.3254 1.4138 6.0421 2.1101 4.3350 3.1666 2.7536 3.6978 1.2747 1.2551 1.3745 1.8216 2.4230 1.0441 1.0817 1.0591 1.0945 1.0441 1.7028 2.2854 7.6017 5.8603 5.8542 6.2367 6.3103 8.7734 9.5256 1.0871 1.0336 1.0327 1.0328 1.1025 1.1022 1.1025 1.1046 1.0899 1.1011 1.1022 1.0880 1.0952 1.0972 1.0746
irintensity: 0.5633 0.5613 0.0655 0.0559 1.3966 0.0357 0.1246 0.7221 1.5235 4.4622 12.3321 2.1267 0.0107 4.5441 11.3048 1.0010 10.9697 0.0449 14.4645 5.4521 0.0232 15.4050 3.8253 1.4683 7.7061 0.3692 31.7997 0.0160 5.7870 5.1466 73.5413 26.6228 7.0780 0.3433 0.9853 13.9172 77.9999 7.1339 4.3475 1.5926 8.3631 2.1001 2.0117 16.0588 0.7165 11.2297 20.0221 24.6931 16.6092 44.4031 1.1674 67.8756 6.0169 0.2499 55.1767 159.2114 10.0776 51.3527 128.2747 159.9490 0.3330 0.1860 0.2881 48.3851 0.7029 1.1422 43.6168 5.7524 2.2356 49.3475 20.0212 29.1308 131.3726 51.9165 2.7972 18.3983 10.2931 6.7269 53.5546 63.3937 213.0380 141.6473 15.9929 2.5311 17.1288 18.9933 18.1628 203.9750 109.6373 145.7208 509.2337 52.7587 75.4991 926.5703 152.3389 490.1588 47.7832 41.4142 40.9664 36.7171 19.1247 17.8717 15.7620 0.1986 11.0211 0.7349 0.8064 2.2555 9.7534 2.0267 10.5529
temp: 298.150 k
press: 1.00000 atm
elementType: 35 8 8 7 7 7 7 7 7 6 6 6 6 6 6 6 6 6 6 6 6 6 6 6 1 1 1 1 1 1 1 1 1 1 1 1 1 1 1
symmnumber: 1
zpe: 763039.6 jmol-1
zpe.correction: 0.290626 hartree
zpe.thermalcorrener: 0.313367 hartree
zpe.thermalcorrenthalpy: 0.314311 hartree
zpe.thermalcorrgfe: 0.235819 hartree
zpe.sumelectzpe: -1071.307619 hartree
zpe.sumelectthermal: -1071.284879 hartree
zpe.sumelectthermalent: -1071.283935 hartree
zpe.sumelectthermalfe: -1071.362427 hartree
dipole: -3.4326 -3.8066 -0.0179
dipole: 5.1257
quadrupole: -187.7922 -138.8940 -151.8875
quadrupole: 1.7793 -0.0102 0.1280
quadrupole: -28.2676 20.6306 7.6371 1.7793 -0.0102 0.1280
hfenergy: -1071.5982459 hartree
pointgroup: C01 [X(C15H15Br1N6O2)]
dipole: 1.6565527 0.2410289 -1.1244744 debye
polarizability: 541.6282265|-75.0511016|129.9833754|45.8037929|-58.1595421|226.1280171 unknown
InChI: InChI=1S/C15H15BrN6O2/c1-20-11-12(21(2)15(24)22(3)13(11)23)18-14(20)19-17-8-9-4-6-10(16)7-5-9/h4-8,19H,1-3H3
charge 0 multiplicity 1
39 atoms
Br 7.919084 -2.13221 2.462188
O  -3.494935 -0.627233 2.273862
O  -6.224153 1.12643 -1.150629
N  -1.09545 -0.124673 0.31243
N  -3.9184 1.005056 -1.57262
N  -4.838331 0.257287 0.529447
N  -1.471416 0.774743 -1.774047
N  0.789441 0.271822 -1.250837
N  1.787534 -0.18745 -0.426437
C  -2.4891 0.104222 0.18756
C  -2.668512 0.64984 -1.094022
C  -3.571062 -0.13548 1.101108
C  -0.546392 0.295131 -0.887019
C  -5.062727 0.816231 -0.757928
C  -0.442195 -0.693606 1.510617
C  -4.069189 1.579695 -2.922781
C  -6.052183 0.067131 1.356562
C  3.02412 -0.161178 -0.891656
C  4.151923 -0.629014 -0.08395
C  5.464858 -0.581595 -0.630273
C  3.981829 -1.133791 1.238209
C  6.580173 -1.022141 0.112369
C  5.085966 -1.576423 1.989413
C  6.377941 -1.516197 1.417579
H  0.289953 0.018649 1.922604
H  -1.235113 -0.892925 2.248166
H  0.081703 -1.628047 1.254866
H  -3.492755 2.516686 -3.002462
H  -5.139362 1.777133 -3.080624
H  -3.696559 0.870117 -3.680527
H  -5.731436 -0.379525 2.308884
H  -6.763343 -0.595454 0.836857
H  -6.547616 1.036331 1.530806
H  0.977686 0.628718 -2.199443
H  3.254476 0.214765 -1.9080
H  5.619136 -0.196841 -1.645721
H  2.975539 -1.17374 1.665996
H  7.584959 -0.980769 -0.317118
H  4.948309 -1.962794 3.003367
