program: Gaussian 09
title: 000239627
version: EM64L-G09RevD.01
frameworkgroup: C1[X(C17H21N7O2)]
method: RPBEPBE
basis: SDD
operation: Freq
keyword: #p
keyword: freq=noraman
keyword: PBEPBE/SDD
title: #p freq=noraman PBEPBE/SDD
converged: YES YES NO NO
title: Mulliken charges:
elementType: O O N N N N N N N C C C C C C C C C C C C C C C C C H H H H H H H H H H H H H H H H H H H H H
charge: -0.299052 -0.277707 -0.199715 -0.160938 -0.221677 -0.143390 -0.358133 0.013049 -0.150235 0.172131 0.119144 0.167949 0.157874 0.202298 -0.631418 -0.618131 -0.603448 0.413384 0.481405 -0.411215 -0.356721 -0.339117 -0.408375 -0.396024 -0.645756 -0.645632 0.288505 0.242437 0.242779 0.243428 0.243297 0.271150 0.246712 0.246577 0.268325 0.304373 0.206673 0.238588 0.238926 0.218039 0.252059 0.236688 0.236769 0.219549 0.237805 0.219129 0.237641
chargesum: 0.00000
title: Mulliken charges with hydrogens summed into heavy atoms:
elementType: O O N N N N N N N C C C C C C C C C C C C C C C C C
charge: -0.299052 -0.277707 -0.199715 -0.160938 -0.221677 -0.143390 -0.053760 0.013049 -0.150235 0.172131 0.119144 0.167949 0.157874 0.202298 0.142303 0.139744 0.158166 0.413384 0.481405 -0.204542 -0.118133 -0.100191 -0.190336 -0.143965 0.047250 0.048943
polarizability: 6.08730981e+02 -5.24073498e+00 2.57490070e+02 -8.01781762e-02 1.48906467e-01 1.16256931e+02
1716.lowfreq: -0.0007 0.0004 0.0014 1.4656 2.1310 6.1423 16.3107 25.6721 27.1900
frequency: 16.3036 25.6469 27.1797 52.3170 76.3695 83.0096 90.4302 107.3389 110.0239 110.7740 117.3660 127.9668 128.9056 162.3680 165.4205 176.7096 195.4509 208.1925 224.8687 237.4743 241.7373 254.4431 268.1375 292.6062 314.0359 324.0227 356.0741 369.5368 376.8144 389.9738 394.3262 413.1625 425.9101 438.7353 460.0405 486.7412 510.9256 527.7320 539.9655 581.2221 608.7503 633.3110 638.2189 685.9417 692.8106 701.3351 701.8552 727.3855 729.0934 738.5315 779.7519 796.8196 805.9150 826.9214 881.2274 916.2801 942.1478 952.3820 953.2490 958.4851 971.1587 994.4303 1030.8590 1051.5965 1056.6588 1092.8514 1107.2711 1111.1178 1129.6960 1132.4504 1133.4669 1133.9479 1166.0157 1179.0996 1196.2960 1197.0334 1226.7154 1230.0793 1253.7368 1259.1188 1267.9291 1299.0105 1302.2049 1324.1338 1357.4033 1367.8107 1381.1573 1394.7978 1412.0906 1426.5034 1430.4353 1441.7232 1448.3765 1459.8315 1461.6406 1465.0248 1474.4290 1476.9749 1477.8121 1480.1129 1480.8736 1486.0805 1492.0002 1494.1195 1505.1028 1519.4890 1527.6534 1546.6048 1556.1906 1579.5414 1601.0955 1629.1648 1632.7418 1645.9032 2943.3594 2950.7693 2972.4334 3004.3124 3008.7519 3009.3458 3010.1244 3013.4108 3092.4019 3099.7220 3100.0030 3109.6275 3110.9791 3114.5042 3120.5155 3135.6589 3136.6114 3145.6362 3166.6020 3171.0848 3409.8104
redmass: 5.2937 3.3724 5.4677 4.6008 2.3042 4.2833 3.7206 5.4379 1.2896 1.5639 1.1779 2.6397 2.7566 5.1680 2.3639 1.1681 1.2449 2.7926 4.5814 4.3545 4.4126 3.4824 3.2915 2.9184 6.4087 3.6795 4.1412 4.3222 8.3276 7.9707 4.1400 6.5655 3.1340 5.0146 4.8234 4.2560 5.7346 2.2220 5.0398 5.3559 1.2852 7.1749 6.4655 11.5466 8.0519 6.4154 11.2622 5.3109 11.0909 3.4344 5.3958 5.5151 1.3175 1.6463 4.4121 1.4244 3.1009 1.4404 2.7665 5.3638 1.3533 2.8721 2.8469 3.0662 1.5048 4.8671 1.2375 1.3246 1.3018 1.2970 1.2904 1.4840 1.6979 3.1594 1.3675 1.9734 3.0009 3.4673 1.7164 2.8871 6.1980 5.7489 2.5959 1.5359 2.5428 3.9153 3.8881 2.7731 1.2766 1.2635 1.2952 1.3736 2.5306 1.3314 1.7558 1.0401 1.0437 1.0456 1.0773 1.0512 1.1050 1.0439 1.1108 1.5892 1.1434 2.1686 2.6741 6.6306 6.5210 5.4413 6.9956 8.4056 6.3040 9.4266 1.0369 1.0394 1.0866 1.0336 1.0325 1.0327 1.0997 1.1027 1.1024 1.0962 1.1021 1.0942 1.1023 1.0895 1.1046 1.1022 1.1010 1.0873 1.0931 1.0951 1.0746
irintensity: 0.0013 0.0264 0.6044 1.6131 0.2515 2.9736 0.5885 0.6370 3.0166 0.4638 2.9271 0.0121 15.7713 2.6814 0.7489 3.4543 1.3783 10.0122 0.8646 1.4374 5.4146 12.6590 4.6091 0.5233 0.3963 9.3489 8.9886 2.0977 0.4086 36.5520 1.4484 12.9021 0.3463 9.1627 19.3780 33.8161 41.1012 18.7977 0.4921 2.0622 72.3177 1.1479 25.3431 2.7603 0.4951 4.1142 6.3779 10.4808 16.8324 0.7797 2.9953 0.3868 12.1531 56.0716 2.0738 26.5963 41.4335 10.9474 6.5371 81.1281 0.6892 0.2198 212.2884 11.6705 28.3118 256.6233 0.0016 1.0350 0.3305 0.2397 0.3375 24.4181 9.9429 31.9243 101.1839 41.1366 57.0877 11.8863 18.7386 31.0280 47.3967 20.7201 144.5912 29.1233 142.3186 185.4152 9.7470 22.5410 8.2241 44.6031 12.9415 67.9305 28.0889 129.6205 148.4196 0.0864 15.3626 22.9659 1.9434 18.6386 20.8325 17.0641 10.7079 261.5998 51.3146 130.4439 552.8024 9.7600 380.8800 0.7817 1148.0523 263.8158 365.7200 472.9700 101.8951 176.4638 56.1588 42.4586 59.0536 25.4393 9.5927 74.8086 20.0424 4.2098 19.7530 51.0298 16.6421 13.4448 0.4159 0.9571 0.8090 5.6557 26.6139 15.3568 10.9968
temp: 298.150 k
press: 1.00000 atm
elementType: 8 8 7 7 7 7 7 7 7 6 6 6 6 6 6 6 6 6 6 6 6 6 6 6 6 6 1 1 1 1 1 1 1 1 1 1 1 1 1 1 1 1 1 1 1 1 1
symmnumber: 1
zpe: 977384.3 jmol-1
zpe.correction: 0.372266 hartree
zpe.thermalcorrener: 0.398024 hartree
zpe.thermalcorrenthalpy: 0.398969 hartree
zpe.thermalcorrgfe: 0.315006 hartree
zpe.sumelectzpe: -1192.226181 hartree
zpe.sumelectthermal: -1192.200422 hartree
zpe.sumelectthermalent: -1192.199478 hartree
zpe.sumelectthermalfe: -1192.283441 hartree
dipole: -10.8074 -1.6917 0.0122
dipole: 10.9390
quadrupole: -129.7466 -143.8923 -157.0095
quadrupole: -10.3850 -0.3773 0.2023
quadrupole: 13.8029 -0.3428 -13.4601 -10.3850 -0.3773 0.2023
hfenergy: -1192.5984469 hartree
pointgroup: C01 [X(C17H21N7O2)]
dipole: 4.2859671 0.2331072 0.3135887 debye
polarizability: 604.6573002|20.6157304|118.3401014|-34.3522233|11.6197229|259.4805807 unknown
InChI: InChI=1S/C17H21N7O2/c1-21(2)12-8-6-11(7-9-12)10-18-20-16-19-14-13(22(16)3)15(25)24(5)17(26)23(14)4/h6-10,20H,1-5H3
charge 0 multiplicity 1
47 atoms
O  -3.815258 -0.465444 -2.395407
O  -7.060529 -0.363914 1.027839
N  -1.699044 -0.152017 -0.090873
N  -4.811199 -0.181994 1.674766
N  -5.420016 -0.409072 -0.647105
N  -2.389983 -0.006995 2.102452
N  -0.044293 0.097217 1.733941
N  1.083266 0.076607 0.93139
N  7.274791 0.139589 -1.232237
C  -3.115965 -0.232793 -0.07959
C  -3.485674 -0.139704 1.272399
C  -4.061939 -0.375178 -1.147454
C  -1.325865 -0.019146 1.236811
C  -5.836502 -0.320675 0.707115
C  -0.867308 -0.206632 -1.311516
C  -5.162667 -0.085073 3.103357
C  -6.510877 -0.5531 -1.637263
C  6.049853 0.155962 -0.563733
C  3.513397 0.181499 0.811547
C  2.251511 0.193442 1.541673
C  5.979919 0.298168 0.860566
C  4.810319 0.029452 -1.279271
C  4.741424 0.309011 1.520239
C  3.582958 0.042516 -0.606464
C  8.527036 0.27155 -0.475715
C  7.318482 -0.010999 -2.693494
H  -1.553756 -0.315884 -2.165624
H  -0.274716 0.715972 -1.414176
H  -0.174864 -1.061743 -1.266559
H  -4.688967 -0.906995 3.666201
H  -4.808901 0.874427 3.517084
H  -6.257657 -0.151822 3.179892
H  -7.195879 0.308395 -1.574675
H  -7.089724 -1.469009 -1.433464
H  -6.042621 -0.604393 -2.631083
H  0.012204 0.19274 2.758161
H  2.315949 0.303731 2.643557
H  6.894156 0.398842 1.451393
H  4.813889 -0.079683 -2.367298
H  4.722924 0.417883 2.612557
H  2.649548 -0.056245 -1.170573
H  8.652243 -0.55008 0.258538
H  8.575195 1.232687 0.075302
H  9.380504 0.237351 -1.170484
H  6.859532 -0.96517 -3.022331
H  8.366811 -0.006629 -3.030154
H  6.792391 0.817651 -3.209235
