program: Gaussian 09
title: 000239626
version: EM64L-G09RevD.01
frameworkgroup: C1[X(C15H15N7O4)]
method: RPBEPBE
basis: SDD
operation: Freq
keyword: #p
keyword: freq=noraman
keyword: PBEPBE/SDD
title: #p freq=noraman PBEPBE/SDD
converged: YES YES NO NO
title: Mulliken charges:
elementType: O O O O N N N N N N N C C C C C C C C C C C C C C C H H H H H H H H H H H H H H H
charge: -0.290307 -0.267333 -0.200741 -0.205235 -0.195107 -0.161534 -0.221554 -0.135495 -0.355137 0.031369 0.021608 0.172903 0.123069 0.172309 0.163913 0.205773 -0.630083 -0.616128 -0.600852 0.492819 -0.398481 -0.508047 -0.375266 0.382918 -0.181178 -0.361197 0.242465 0.294965 0.242861 0.274025 0.245458 0.245379 0.269165 0.250185 0.250330 0.316436 0.222493 0.282857 0.267182 0.242698 0.290494
chargesum: 0.00000
title: Mulliken charges with hydrogens summed into heavy atoms:
elementType: O O O O N N N N N N N C C C C C C C C C C C C C C C
charge: -0.290307 -0.267333 -0.200741 -0.205235 -0.195107 -0.161534 -0.221554 -0.135495 -0.038701 0.031369 0.021608 0.172903 0.123069 0.172309 0.163913 0.205773 0.150209 0.148734 0.168828 0.492819 -0.175988 -0.225190 -0.108084 0.382918 0.061521 -0.070702
polarizability: 5.56425717e+02 -5.29746453e+00 2.45821991e+02 8.53909446e-02 5.24106966e-01 9.86436102e+01
1716.lowfreq: -3.3994 -0.9481 -0.0007 -0.0004 0.0004 5.0349 17.4248 18.7463 29.2256
frequency: 17.3959 18.7435 29.1923 53.4043 72.0221 78.3300 87.4603 104.8405 106.5268 110.1544 128.2463 144.2197 147.8681 171.2034 186.9807 212.6434 234.9453 238.9110 249.7661 254.7733 294.9505 300.2693 321.3934 327.5919 353.4685 376.0690 381.1408 388.5222 416.6479 418.4491 425.4397 463.1161 509.5582 521.6045 532.0932 548.9495 629.4201 634.7411 655.9296 664.4280 685.3629 687.0433 700.2548 703.3724 704.1102 711.5755 732.8441 767.3348 779.6880 823.5599 825.5230 898.9732 914.9642 946.6891 951.1968 951.4114 959.1610 985.9118 1005.3851 1030.8593 1050.6767 1082.3189 1090.6700 1127.9982 1129.7515 1132.4731 1133.0328 1172.8386 1177.8715 1194.5859 1212.1930 1226.9565 1228.9051 1243.9116 1267.7260 1297.6753 1299.1150 1308.3038 1356.6653 1374.2062 1388.0955 1404.0353 1413.7233 1426.5412 1435.2982 1439.3581 1461.1426 1474.0297 1476.5941 1477.5133 1478.4613 1479.7868 1487.1203 1494.6890 1521.5842 1556.2365 1558.3689 1586.1132 1599.7571 1616.3081 1625.0656 1644.4443 3002.1092 3006.4306 3007.2888 3012.0337 3095.7046 3103.8987 3109.4588 3119.7762 3138.5299 3138.8673 3151.0400 3162.5254 3171.8375 3190.0773 3401.3279
redmass: 7.6729 5.3845 7.1736 9.8896 3.6177 1.2065 3.0084 8.0735 2.3688 1.4801 3.3115 6.1975 6.6166 2.9705 1.2680 3.2925 5.9592 5.1339 5.2459 4.5332 2.9413 4.7455 5.8039 3.9896 4.5289 7.4193 8.1726 9.9427 7.5360 6.5894 3.2526 7.2815 7.9526 6.7741 4.5790 5.4206 7.1013 5.0654 1.4050 9.2486 2.8184 5.1088 7.2544 10.9969 5.5939 7.6292 11.1394 7.5045 5.4074 1.4724 5.7627 1.4293 3.8791 1.5846 1.4174 2.8274 5.1249 6.2251 1.3623 2.7015 3.0192 1.7660 1.7184 4.8373 1.3022 1.2977 1.2922 1.1544 2.9677 3.0420 5.1689 4.3374 2.7766 2.2074 6.6119 3.2820 2.0843 1.9247 3.2085 10.0776 3.4837 3.5650 1.2859 1.2534 2.6483 1.6327 1.7883 1.0434 1.3357 1.7465 1.0430 1.1469 1.0453 1.7307 2.3641 6.6805 5.2828 5.9145 6.0115 7.4959 8.4936 9.5184 1.0857 1.0337 1.0343 1.0328 1.1025 1.1022 1.1025 1.1046 1.1011 1.1023 1.0878 1.0919 1.0944 1.0965 1.0747
irintensity: 2.4788 0.0790 2.0022 0.0681 0.3961 0.0148 0.6363 2.8060 0.5491 0.4588 18.3808 0.4712 0.6717 4.1096 0.2007 15.4176 3.6123 7.9457 3.3203 16.1689 0.2120 0.0702 0.1608 2.7735 9.8358 1.9291 0.2561 33.0304 3.4883 9.5486 0.2829 33.1968 35.1946 6.6011 4.1278 1.0353 4.0501 1.3278 84.1954 28.3905 10.7177 24.5355 4.8834 7.2457 16.9801 18.5988 15.3329 12.3070 0.3103 28.8054 6.6617 6.6174 0.6648 32.4389 22.1740 2.2200 62.8567 2.1563 1.0653 148.5018 10.2084 8.4858 44.5392 236.2322 0.2953 0.2301 0.2657 21.8141 37.3445 5.0984 382.8064 7.1453 5.4301 47.6094 51.6821 34.4804 13.8133 129.4001 81.4907 101.8318 16.9601 3.4550 7.0512 62.5976 7.3050 65.7407 169.8649 16.7916 28.9778 66.9361 17.6216 21.7580 18.5498 191.7156 110.0509 847.2223 3.4571 47.7539 743.3906 90.9330 174.6951 485.0975 25.9168 50.0239 38.0419 35.7156 18.4677 17.0021 15.8398 0.2033 0.5549 0.9497 8.1689 4.7693 6.5004 7.5481 14.3982
temp: 298.150 k
press: 1.00000 atm
elementType: 8 8 8 8 7 7 7 7 7 7 7 6 6 6 6 6 6 6 6 6 6 6 6 6 6 6 1 1 1 1 1 1 1 1 1 1 1 1 1 1 1
symmnumber: 1
zpe: 792763.3 jmol-1
zpe.correction: 0.301948 hartree
zpe.thermalcorrener: 0.325872 hartree
zpe.thermalcorrenthalpy: 0.326816 hartree
zpe.thermalcorrgfe: 0.246074 hartree
zpe.sumelectzpe: -1262.820093 hartree
zpe.sumelectthermal: -1262.796169 hartree
zpe.sumelectthermalent: -1262.795224 hartree
zpe.sumelectthermalfe: -1262.875967 hartree
dipole: 0.1308 -0.0423 0.0568
dipole: 0.1487
quadrupole: -226.6831 -144.3732 -150.7714
quadrupole: -15.8349 -0.4039 0.1161
quadrupole: -52.7405 29.5694 23.1711 -15.8349 -0.4039 0.1161
hfenergy: -1263.1220409 hartree
pointgroup: C01 [X(C15H15N7O4)]
dipole: -0.0492023 -0.0303462 0.0090011 debye
polarizability: 553.5140195|28.8623678|121.6448613|-15.2729559|-52.7366446|225.7324374 unknown
InChI: InChI=1S/C15H15N7O4/c1-19-11-12(20(2)15(24)21(3)13(11)23)17-14(19)18-16-8-9-5-4-6-10(7-9)22(25)26/h4-8,18H,1-3H3
charge 0 multiplicity 1
41 atoms
O  -4.087993 0.768208 -2.26476
O  -6.912908 -0.811221 1.166398
O  8.321287 0.624189 -0.448029
O  7.43685 -0.193456 1.48804
N  -1.71942 0.064914 -0.33255
N  -4.601358 -0.871194 1.56826
N  -5.48036 -0.032395 -0.518482
N  -2.14153 -0.827263 1.747868
N  0.145752 -0.48793 1.209217
N  1.165016 -0.100719 0.381423
N  7.322406 0.274745 0.290014
C  -3.124203 -0.061519 -0.196133
C  -3.332933 -0.606406 1.081368
C  -4.193436 0.270038 -1.097345
C  -1.192994 -0.408142 0.857009
C  -5.735291 -0.586826 0.766127
C  -1.036761 0.598338 -1.530579
C  -4.783949 -1.446783 2.914497
C  -6.684254 0.25754 -1.331709
C  3.543216 0.176052 -0.002787
C  2.40285 -0.21726 0.829103
C  4.855061 0.042985 0.521315
C  3.379405 0.689519 -1.324901
C  5.954217 0.420546 -0.274034
C  4.496725 1.05875 -2.097742
C  5.806229 0.929629 -1.581604
H  -0.371277 -0.164942 -1.964151
H  -1.81979 0.873318 -2.254253
H  -0.435629 1.482809 -1.266887
H  -5.864673 -1.561495 3.081698
H  -4.349706 -0.776477 3.675092
H  -4.282638 -2.427104 2.978983
H  -6.33955 0.678095 -2.287463
H  -7.332939 0.975413 -0.803729
H  -7.258701 -0.667972 -1.499783
H  0.313199 -0.86581 2.153907
H  2.625585 -0.611419 1.839125
H  5.035672 -0.345744 1.52847
H  2.366159 0.789623 -1.725388
H  4.352834 1.450536 -3.10967
H  6.691534 1.208431 -2.158337
