program: Gaussian 09
title: 000019711
version: EM64L-G09RevD.01
frameworkgroup: C1[X(C13H27NO)]
method: RPBEPBE
basis: SDD
operation: Freq
keyword: #p
keyword: freq=noraman
keyword: PBEPBE/SDD
title: #p freq=noraman PBEPBE/SDD
converged: NO YES NO NO
title: Mulliken charges:
elementType: O N C C C C C C C C C C C C C H H H H H H H H H H H H H H H H H H H H H H H H H H H
charge: -0.215188 -0.107942 0.420302 -0.074981 -0.482229 -0.398019 -0.806694 -0.755208 -0.558827 -0.712012 -0.648985 -0.627734 0.228748 -0.490328 -0.673480 0.193341 0.267528 0.204828 0.196067 0.219733 0.223911 0.216206 0.210927 0.220891 0.195524 0.230219 0.238671 0.244679 0.216380 0.211337 0.215901 0.216344 0.222940 0.202110 0.222494 0.217364 0.184185 0.230293 0.230641 0.223469 0.209821 0.236771
chargesum: 0.00000
title: Mulliken charges with hydrogens summed into heavy atoms:
elementType: O N C C C C C C C C C C C C C
charge: -0.215188 -0.107942 0.420302 0.118359 -0.009873 0.017782 -0.155649 -0.108573 -0.075477 -0.068395 -0.007590 -0.003692 0.228748 -0.029394 -0.003418
polarizability: 1.80528716e+02 -3.50460912e-01 1.44924084e+02 -1.33200186e+00 -1.90661407e+00 1.27807477e+02
1716.lowfreq: -21.7136 -7.4615 -3.0711 -0.0004 -0.0003 0.0005 18.0307 31.7694 48.2288
frequency: 14.9043 25.9191 47.6442 65.8011 85.3864 90.8562 103.4772 111.6869 169.3980 179.1886 194.0059 196.8773 216.4610 228.4209 235.3569 242.9112 257.0163 261.7558 286.9919 300.8492 315.2626 326.5619 359.2666 393.4756 402.0961 421.8297 462.2394 470.1754 511.0768 576.9424 643.4834 698.7863 720.3096 780.3751 790.7199 808.1714 830.7487 864.2892 910.7477 921.6943 940.0203 972.9007 987.8873 1000.6813 1010.6983 1026.6394 1037.9872 1038.3728 1051.3871 1074.8638 1085.3906 1086.4079 1099.6250 1116.8950 1137.7769 1147.2712 1164.8322 1184.5719 1213.3743 1218.7139 1247.1663 1257.3836 1268.0724 1273.7574 1304.9832 1318.7000 1328.3473 1337.0018 1348.6253 1376.4178 1381.2825 1393.0828 1395.3722 1398.0865 1421.9617 1430.7588 1434.1925 1441.9055 1452.3095 1458.0133 1462.0770 1463.2350 1470.2982 1470.7282 1472.8660 1478.2991 1479.5412 1482.4436 1485.9105 1491.8495 1494.6483 1496.3315 1631.6400 2839.5295 2870.0742 2957.7269 2961.9859 2963.6609 2968.7747 2975.2363 2977.3425 2980.7887 2983.4152 2996.4221 3002.0768 3004.9949 3010.8702 3026.9265 3029.6058 3061.7897 3062.9177 3066.3632 3070.2911 3074.3801 3075.1837 3082.1021 3085.6158 3091.5467 3098.3527 3100.3229
redmass: 4.7571 2.6034 2.9678 3.0370 1.7552 2.5070 2.5517 2.0211 2.3915 1.9038 1.4901 1.4609 1.1282 1.8197 1.6006 1.3878 1.3229 1.3223 2.7943 2.4483 2.3005 2.5465 2.3253 2.5340 2.4330 2.8906 2.8086 2.1754 2.8284 2.9149 3.0128 1.9437 1.3086 1.4456 2.1331 2.4592 2.7735 2.1520 1.8836 1.6153 1.3353 1.8614 2.7376 1.3480 2.2287 1.8219 1.4730 1.5370 2.4880 2.2113 1.9033 1.2570 2.1969 2.1329 1.4569 1.8074 2.1350 2.4702 1.9509 2.2659 1.2440 2.1849 1.5862 1.5537 1.2145 1.2649 1.6159 1.4468 1.6308 1.2050 1.2548 1.2048 1.2102 1.2088 1.1437 1.0890 1.0886 1.1437 1.0575 1.0530 1.0641 1.0640 1.0434 1.0632 1.0579 1.0521 1.0495 1.0521 1.0639 1.0535 1.0538 1.0535 7.7014 1.0576 1.0572 1.0612 1.0815 1.0650 1.0603 1.0394 1.0370 1.0563 1.0487 1.0371 1.0709 1.0950 1.0755 1.0958 1.0928 1.0992 1.0985 1.0999 1.0976 1.0972 1.0989 1.0955 1.0959 1.1003 1.0966 1.0997
irintensity: 5.2114 0.5091 0.9140 0.8028 0.1790 0.1814 1.0735 0.0257 0.3110 0.9936 0.2810 0.1154 0.2177 1.4008 1.1366 0.8017 0.8930 2.2098 8.1766 1.6037 0.3192 0.8680 1.2915 2.8912 1.7210 2.2349 10.6355 0.5987 5.8510 1.1279 3.8675 3.5001 1.4271 10.9729 4.3186 14.9842 5.1511 3.9324 27.0532 0.6780 2.3494 4.6975 6.8841 6.1477 64.6678 8.3470 2.0100 10.2082 1.6147 13.3058 12.3754 7.1590 10.6765 37.8997 1.6845 11.1969 10.4796 14.5870 5.3360 14.9506 0.0699 0.5251 29.7962 37.1359 4.8377 1.5077 33.1312 4.4112 33.1977 15.9562 3.8271 19.0885 21.7451 12.1648 9.4675 19.6659 11.9343 3.3633 4.0306 13.2458 9.8436 4.8321 16.4493 7.1717 9.5994 16.8323 12.7717 8.6971 6.5657 17.1290 11.2358 7.0635 77.5662 115.1707 145.1467 29.6736 13.8736 5.2566 48.1562 30.4652 34.7921 49.3310 7.2194 30.5942 51.1297 12.0488 49.2104 17.1013 16.6890 20.8203 64.1795 39.2495 73.9310 38.9423 42.4822 46.0517 15.4987 32.6242 41.4709 28.8058
temp: 298.150 k
press: 1.00000 atm
elementType: 8 7 6 6 6 6 6 6 6 6 6 6 6 6 6 1 1 1 1 1 1 1 1 1 1 1 1 1 1 1 1 1 1 1 1 1 1 1 1 1 1 1
symmnumber: 1
zpe: 988026.0 jmol-1
zpe.correction: 0.376319 hartree
zpe.thermalcorrener: 0.396329 hartree
zpe.thermalcorrenthalpy: 0.397274 hartree
zpe.thermalcorrgfe: 0.327071 hartree
zpe.sumelectzpe: -640.266485 hartree
zpe.sumelectthermal: -640.246474 hartree
zpe.sumelectthermalent: -640.245530 hartree
zpe.sumelectthermalfe: -640.315732 hartree
dipole: 0.6989 -1.9652 0.7427
dipole: 2.2140
quadrupole: -91.5158 -101.2840 -94.6002
quadrupole: 10.7115 -2.0436 0.4058
quadrupole: 4.2842 -5.4840 1.1998 10.7115 -2.0436 0.4058
hfenergy: -640.6428038 hartree
pointgroup: C01 [X(C13H27N1O1)]
dipole: -0.2619697 0.8022993 0.2155248 debye
polarizability: 180.2870174|0.0942852|145.1255784|-3.8246747|-0.3723594|127.8476818 unknown
InChI: InChI=1S/C13H27NO/c1-7-11(15)9-10-13(3,4)12(8-2)14(5)6/h12H,7-10H2,1-6H3
charge 0 multiplicity 1
42 atoms
O  3.106605 -1.356555 -0.67787
N  -3.214475 0.415114 -0.501461
C  -0.744239 0.581826 0.248352
C  -1.96082 -0.351688 -0.19919
C  0.552161 -0.039692 -0.382321
C  -2.261814 -1.57809 0.72752
C  -0.596904 0.67197 1.793788
C  -0.935162 2.01139 -0.327721
C  1.883424 0.670892 -0.054554
C  -1.214759 -2.714844 0.761538
C  -4.025713 0.846828 0.652541
C  -4.044155 -0.192788 -1.557041
C  3.114903 -0.103381 -0.543104
C  4.361718 0.733341 -0.845494
C  5.634277 -0.095661 -1.086403
H  -1.656018 -0.765974 -1.183712
H  0.658114 -1.09529 -0.081186
H  0.428438 -0.047151 -1.484839
H  -3.21763 -2.014174 0.369729
H  -2.455631 -1.229576 1.759824
H  -0.298148 -0.294532 2.239524
H  -1.539357 0.98677 2.275824
H  0.167896 1.421086 2.071634
H  -1.068383 1.981842 -1.423855
H  -0.056716 2.643162 -0.09376
H  -1.829977 2.50268 0.087424
H  1.91945 1.699482 -0.460269
H  2.003692 0.773214 1.045399
H  -0.282229 -2.419176 1.273404
H  -1.619432 -3.592174 1.300701
H  -0.943843 -3.045472 -0.25898
H  -4.803221 1.552166 0.302538
H  -3.40015 1.379264 1.387897
H  -4.546807 0.013203 1.185463
H  -3.427519 -0.392207 -2.451821
H  -4.84454 0.514154 -1.846902
H  -4.541156 -1.153428 -1.262216
H  4.124213 1.353638 -1.736973
H  4.501122 1.461753 -0.019891
H  5.901897 -0.677938 -0.187468
H  6.485825 0.55801 -1.34653
H  5.479063 -0.818393 -1.90524
