program: Gaussian 09
title: 000239624
version: EM64L-G09RevD.01
frameworkgroup: C1[X(C10H13NO2)]
method: RPBEPBE
basis: SDD
operation: Freq
keyword: #p
keyword: freq=noraman
keyword: PBEPBE/SDD
title: #p freq=noraman PBEPBE/SDD
converged: NO YES NO NO
title: Mulliken charges:
elementType: O O N C C C C C C C C C C H H H H H H H H H H H H H
charge: -0.316221 -0.271319 -0.467392 0.305963 0.279140 -0.350723 -0.383380 -0.843782 -0.231157 -0.251205 0.255809 -0.212721 -0.673918 0.298235 0.227020 0.351035 0.230608 0.230612 0.243418 0.226458 0.226348 0.228584 0.228593 0.212673 0.228661 0.228661
chargesum: 0.00000
title: Mulliken charges with hydrogens summed into heavy atoms:
elementType: O O N C C C C C C C C C C
charge: -0.316221 -0.271319 -0.116357 0.305963 0.279140 -0.052488 -0.156361 -0.139144 -0.004699 -0.024857 0.255809 0.244456 -0.003922
polarizability: 1.85017513e+02 -2.41346400e+00 1.28233794e+02 1.24297742e-02 -8.26596558e-04 6.40337785e+01
1716.lowfreq: -0.0011 -0.0003 0.0007 1.5256 9.2232 15.6798 28.1855 63.0369 66.7647
frequency: 26.4306 63.0230 66.7598 90.6824 126.6788 183.3809 202.4797 206.1862 253.1514 253.2520 289.8459 321.4298 382.3791 421.0472 444.7679 526.2595 539.4876 600.8774 639.2448 700.3948 702.4478 727.1982 764.3290 766.6444 800.6981 821.2404 871.2483 879.2618 951.1198 975.8319 982.7599 992.5501 1042.0116 1042.2567 1049.4401 1110.8432 1116.2009 1140.7119 1161.5482 1174.5333 1199.2640 1249.4202 1271.9792 1303.8741 1355.3584 1379.0945 1398.0405 1400.2817 1442.2018 1455.8248 1463.6553 1476.5088 1481.4483 1489.8899 1490.5009 1522.9332 1597.1315 1619.1693 1665.5373 2952.9742 2993.6399 3007.0832 3021.2109 3064.6605 3085.4989 3091.4170 3103.8863 3119.3752 3135.5065 3159.1704 3187.6744 3553.7036
redmass: 2.5476 4.1866 3.7740 3.8054 3.2096 3.2822 1.0707 4.2370 4.2361 1.1884 3.4816 6.3225 3.7119 3.2693 2.9797 5.3039 3.0969 6.4524 1.3104 6.3083 6.9850 2.9285 4.5014 1.3274 1.0942 4.4500 4.0381 1.3015 1.3655 2.9925 1.9147 1.3037 1.5215 3.0565 2.2773 2.2582 1.8712 1.4662 3.0766 1.1095 1.9928 1.1289 2.1175 1.5785 1.4077 4.3474 1.2712 1.2926 2.2231 1.8682 1.0406 1.0565 1.0443 1.0944 1.3734 2.1231 5.5846 5.8959 8.2746 1.0398 1.0355 1.0580 1.0978 1.1067 1.0950 1.0986 1.1028 1.0874 1.0898 1.0981 1.0951 1.0754
irintensity: 0.0524 0.3175 4.2797 0.7381 5.0962 0.0184 1.0761 6.5431 0.0184 0.3514 6.9154 12.5667 4.9953 0.1943 8.5121 3.5234 6.5834 1.1778 45.6893 40.3901 9.9103 0.3718 2.3339 99.6544 4.0057 7.5111 1.5691 3.0029 3.5618 105.7880 5.2927 1.5690 7.0339 219.4829 17.1797 31.9071 10.1517 4.8211 408.4820 2.5502 11.8761 0.0223 7.8798 35.1906 33.7321 39.8761 21.7789 24.7249 30.8121 167.9186 11.8844 7.5161 14.1868 19.3972 34.2405 392.1272 91.9319 13.9302 238.4051 32.8156 22.9506 25.2895 22.6911 8.5279 18.0671 31.7855 47.8260 9.5524 18.6756 27.5449 6.6785 36.0612
temp: 298.150 k
press: 1.00000 atm
elementType: 8 8 7 6 6 6 6 6 6 6 6 6 6 1 1 1 1 1 1 1 1 1 1 1 1 1
symmnumber: 1
zpe: 557152.0 jmol-1
zpe.correction: 0.212208 hartree
zpe.thermalcorrener: 0.225317 hartree
zpe.thermalcorrenthalpy: 0.226261 hartree
zpe.thermalcorrgfe: 0.171545 hartree
zpe.sumelectzpe: -593.114062 hartree
zpe.sumelectthermal: -593.100953 hartree
zpe.sumelectthermalent: -593.100009 hartree
zpe.sumelectthermalfe: -593.154725 hartree
dipole: -0.8791 2.7338 0.0001
dipole: 2.8716
quadrupole: -62.4383 -75.1344 -80.4025
quadrupole: -0.0307 0.0006 -0.0007
quadrupole: 10.2201 -2.4760 -7.7441 -0.0307 0.0006 -0.0007
hfenergy: -593.3262698 hartree
pointgroup: C01 [X(C10H13N1O2)]
dipole: 0.3335494 -1.0794251 0.0000531 debye
dipolederiv: -2.1254105 0.1753209 -0.0000658 0.5383828 -0.5395305 -0.0000385 -0.0005174 0.0000546 -0.3116609 -0.7908198 -0.04456 0.0000183 -0.2551521 -0.9623208 0.0002027 -0.0001732 -0.0002017 -0.3370347 -2.0640276 -0.1733827 0.000084 -0.5011739 -0.4458881 0.0000075 0.0001717 -0.0000014 -0.3194211 1.3335709 -0.0827967 -0.0001952 -0.3601419 -0.0359666 0.0000431 -0.0002534 0.0000317 0.0703054 -0.2836253 -0.032323 0.0000214 -0.1610327 0.2246167 0.0000363 0.0000957 0.0000082 -0.0754027 -0.2403531 -0.0108376 -0.0000056 0.2423555 -0.0780532 -0.0000413 0.0000237 0.0000155 -0.1651171 0.1038318 0.0494844 -0.000054 0.0576188 0.027918 -0.0000135 -0.0000741 -0.0000187 -0.1661055 0.007762 0.0519502 0.0000101 0.0583261 -0.0686229 -0.0000062 0.0000154 -0.0000095 0.0915047 0.0596339 0.0162883 -0.0000412 -0.076054 0.1298324 0.0000095 -0.0000633 -0.0000022 -0.1595889 -0.035018 -0.0433395 -0.0000409 -0.0000349 -0.1252274 0.0000008 -0.0000298 0.000007 -0.1773299 2.7857219 0.0881091 -0.0000147 0.3018758 1.3901405 -0.0002305 0.0004305 0.0001086 0.3000159 1.146645 0.0041358 0.0000756 0.2528565 0.249229 0.0000204 0.0001486 -0.0000137 0.3573926 -0.1218529 0.0841863 -0.0000279 0.0523691 0.0038507 0.000028 -0.0000418 0.0000247 0.065523 0.1369578 -0.0624312 0.0000221 -0.0537794 0.0610177 0.0000081 0.000036 0.0000058 0.1771953 -0.0122481 -0.0927395 0.0000314 -0.1316313 -0.0493346 0.0000271 0.0000295 0.0000259 0.1500384 0.217056 0.0149835 0.0000298 0.0533531 0.1788985 -0.0000019 0.0000452 0.0000024 0.2970319 0.0336866 0.0920198 0.1170525 0.0406818 0.0132002 -0.0102749 0.1072563 -0.0654985 -0.0457079 0.0335874 0.092044 -0.1170811 0.0406847 0.0132091 0.0102535 -0.1072895 0.0654482 -0.045602 -0.0710621 -0.1710132 0.0000423 -0.0534691 0.0160671 0.0000135 0.0000444 0.0000417 0.1141843 0.0582624 0.0506028 0.0000183 0.0775195 -0.1098628 -0.000013 0.0000181 -0.0000104 0.1557637 -0.1321084 0.0568527 0.0000607 0.0481703 0.072576 -0.0000094 0.0000703 -0.0000117 0.1674747 -0.0592255 0.0217698 -0.0200443 -0.0793893 -0.0050816 0.0912962 0.0213576 0.1041496 -0.0638019 -0.0592362 0.0218278 0.0200779 -0.0793286 -0.0050782 -0.0913051 -0.021327 -0.1041272 -0.0637842 -0.1553765 -0.0708597 -0.0000535 -0.0978352 0.0364506 -0.0000254 -0.0000682 -0.0000177 0.1155101 0.1168175 -0.0176761 0.0325158 0.0423863 0.0039825 0.1054319 0.001134 0.1175055 -0.0656836 0.1168309 -0.0176162 -0.0324359 0.0424423 0.0039777 -0.1054189 -0.0010392 -0.1175167 -0.0656995 unknown
polarizability: 184.9548991|-3.0620782|128.2964074|-0.0124195|0.0009687|64.0337785 unknown
InChI: InChI=1S/C10H13NO2/c1-3-13-10(12)11-9-7-5-4-6-8(9)2/h4-7,11H,3H2,1-2H3
charge 0 multiplicity 1
26 atoms
O  2.680404 -0.406333 -0.000459
O  1.589138 1.683895 -0.000389
N  0.42433 -0.391051 -0.000553
C  -0.946645 -0.00925 -0.000242
C  -1.919882 -1.058993 -0.00003
C  -1.351472 1.350759 -0.000157
C  -3.287773 -0.702113 0.000255
C  -1.501254 -2.520688 -0.000107
C  -2.725877 1.670247 0.000134
C  -3.702243 0.649505 0.000339
C  1.541848 0.428648 -0.000729
C  3.983741 0.315821 -0.000127
C  5.074422 -0.750285 0.000157
H  -0.592629 2.13565 -0.000314
H  -4.038735 -1.501726 0.000418
H  0.636167 -1.39012 -0.000618
H  -0.902596 -2.785709 -0.895622
H  -0.902166 -2.785677 0.895128
H  -2.387431 -3.176704 0.000114
H  -3.028711 2.723397 0.000196
H  -4.768943 0.898116 0.000564
H  4.025956 0.96308 -0.895101
H  4.025509 0.963097 0.894856
H  6.066822 -0.263919 0.000401
H  5.001386 -1.390665 0.896277
H  5.001836 -1.39068 -0.89599
