program: Gaussian 09
title: 000239622
version: EM64L-G09RevD.01
frameworkgroup: C1[X(C10H16S5)]
method: RPBEPBE
basis: SDD
operation: Freq
keyword: #pfreq=noraman
keyword: PBEPBE/SDD
title: #p freq=noraman PBEPBE/SDD
converged: NO YES NO NO
title: Mulliken charges:
elementType: S S S S S C C C C C C C C C C H H H H H H H H H H H H H H H H
charge: 0.324204 0.076397 0.076399 0.190496 0.190496 -0.524000 -0.524001 -0.249216 -0.312868 -0.249215 -0.312869 -0.684952 -0.697568 -0.684952 -0.697568 0.239889 0.248534 0.249415 0.245209 0.239890 0.248535 0.249415 0.245209 0.271463 0.259224 0.262573 0.263302 0.271462 0.259224 0.262573 0.263301
chargesum: 0.00000
title: Mulliken charges with hydrogens summed into heavy atoms:
elementType: S S S S S C C C C C C C C C C
charge: 0.324204 0.076397 0.076399 0.190496 0.190496 -0.524000 -0.524001 0.239208 0.181756 0.239209 0.181754 -0.154265 -0.171694 -0.154266 -0.171693
polarizability: 2.60140835e+02 7.19505574e+00 1.62492318e+02 -6.46417112e-03 -1.51453412e-03 1.47537914e+02
1716.lowfreq: -8.8099 0.0026 0.0030 0.0031 4.5829 9.5949 26.5544 59.8875 95.1374
frequency: 26.5040 59.8871 95.1178 106.5532 142.0205 171.4511 172.2506 218.7074 229.0718 233.5781 237.5139 260.8523 311.4631 332.4488 347.0881 359.7098 373.8518 377.3015 409.2274 421.2100 429.5809 457.3925 460.2131 500.9112 524.0108 610.6427 611.5802 639.6123 639.7135 695.6357 742.0538 783.1344 784.0796 831.6866 837.7136 928.0084 928.3693 943.1079 949.3015 984.1789 987.8729 1021.1890 1026.2228 1037.0643 1041.9301 1128.0735 1129.5601 1131.4018 1131.5259 1187.0939 1194.1663 1224.3814 1226.9723 1237.4578 1240.5173 1272.5318 1273.6526 1303.1191 1306.2591 1317.9668 1319.1169 1331.9154 1335.6431 1429.9382 1429.9742 1431.6306 1431.7378 1439.5817 1439.5966 1442.0497 1442.0968 2987.7771 2988.1504 2992.1214 2992.2143 3009.1487 3009.2042 3023.6338 3023.6482 3050.1585 3050.4240 3055.4407 3055.6744 3093.4476 3093.7027 3101.0382 3101.1275
redmass: 9.3672 10.7339 6.8598 3.9838 4.9792 3.7204 7.3747 2.8608 5.7004 2.9670 3.6291 3.6046 6.3263 2.6763 2.6979 3.1092 2.8769 9.5655 3.4238 3.4465 4.4120 10.3942 4.3474 3.2771 2.7772 4.8733 4.7916 4.5931 4.6138 3.3294 3.1788 1.5489 1.5416 3.4829 3.5754 1.5403 1.5376 2.1370 2.2390 2.6015 2.5357 1.8325 1.9586 2.6186 2.3366 1.4291 1.0650 1.6480 2.6047 1.1848 1.2159 1.5442 1.6233 1.2827 1.2884 1.1885 1.1859 1.2009 1.2371 1.3388 1.3015 1.3846 1.3934 1.0805 1.0795 1.0824 1.0815 1.0844 1.0859 1.0839 1.0847 1.0595 1.0597 1.0598 1.0597 1.0624 1.0624 1.0607 1.0607 1.0994 1.0995 1.1009 1.1008 1.1037 1.1037 1.1060 1.1060
irintensity: 0.0353 0.8536 0.5497 0.4117 1.3345 1.5789 0.7445 2.9406 0.1209 1.5805 3.5484 1.3177 0.0521 0.9369 0.0535 0.1109 0.8401 0.1053 0.1548 0.1832 0.0027 0.0594 21.0592 0.8645 0.7127 11.6768 0.0725 0.0797 1.4256 5.4080 10.1892 2.0623 0.0088 1.4190 0.1805 7.8334 1.1945 106.2497 4.5675 9.2463 0.2897 17.1185 0.0583 0.1675 3.2853 0.1319 0.4235 6.4009 0.1988 5.5103 11.8624 6.4866 0.3369 26.0940 6.7657 1.6714 41.1432 1.2192 0.3591 3.2301 0.9001 2.0443 1.0354 36.5261 1.2916 6.3617 6.2972 17.4970 1.2364 20.2331 30.7127 0.8860 18.5639 15.7331 5.3294 24.4297 11.8556 18.2851 14.8554 9.7495 6.9979 14.0858 6.9118 32.2258 11.3687 13.5111 3.7266
temp: 298.150 k
press: 1.00000 atm
elementType: 16 16 16 16 16 6 6 6 6 6 6 6 6 6 6 1 1 1 1 1 1 1 1 1 1 1 1 1 1 1 1
symmnumber: 1
zpe: 638123.3 jmol-1
zpe.correction: 0.243048 hartree
zpe.thermalcorrener: 0.259254 hartree
zpe.thermalcorrenthalpy: 0.260198 hartree
zpe.thermalcorrgfe: 0.199361 hartree
zpe.sumelectzpe: -2379.796791 hartree
zpe.sumelectthermal: -2379.780585 hartree
zpe.sumelectthermalent: -2379.779641 hartree
zpe.sumelectthermalfe: -2379.840479 hartree
dipole: 0.0000 -0.0001 -0.4659
dipole: 0.4659
quadrupole: -147.1756 -118.6453 -131.5075
quadrupole: 4.6183 0.0005 -0.0012
quadrupole: -14.7328 13.7975 0.9353 4.6183 0.0005 -0.0012
hfenergy: -2380.0398395 hartree
pointgroup: C01 [X(C10H16S5)]
dipole: 0.0000112 -0.00002 0.1832876 debye
polarizability: 260.1406246|-7.1964842|162.4925286|-0.0064641|0.0015146|147.5379144 unknown
InChI: InChI=1S/C10H16S5/c1-5-11-6-2-9(1)13-10(15-14-9)3-7-12-8-4-10/h1-8H2
charge 0 multiplicity 1
31 atoms
S  0.000074 0.000051 1.491782
S  -0.879918 0.709824 -1.411305
S  0.879757 -0.709287 -1.411506
S  -4.794013 -0.224893 0.029115
S  4.7940 0.225268 0.028648
C  -1.512287 0.098486 0.294945
C  1.512305 -0.098193 0.294765
C  -2.15017 -1.301979 0.189533
C  -2.456881 1.189503 0.856621
C  2.150155 1.302296 0.189486
C  2.456973 -1.18928 0.856186
C  -3.430819 -1.340303 -0.664879
C  -3.75873 1.356162 0.047039
C  3.430721 1.340758 -0.665047
C  3.758744 -1.355806 0.04645
H  -2.3796 -1.647882 1.215784
H  -1.399107 -1.99754 -0.23305
H  -1.910112 2.151039 0.894376
H  -2.715595 0.913474 1.896939
H  2.379682 1.648059 1.215763
H  1.399041 1.997905 -0.232927
H  1.910221 -2.150828 0.893857
H  2.715786 -0.913397 1.896517
H  -3.226914 -1.027229 -1.703349
H  -3.861406 -2.35518 -0.673503
H  -4.40282 2.123215 0.507564
H  -3.554835 1.649282 -0.998845
H  3.226715 1.027831 -1.703542
H  3.861293 2.355642 -0.673568
H  4.402891 -2.122914 0.506802
H  3.554749 -1.648783 -0.999455
