program: Gaussian 09
title: 000239621
version: EM64L-G09RevD.01
frameworkgroup: C1[X(C11H16O2)]
method: RPBEPBE
basis: SDD
operation: Freq
keyword: #pfreq=noraman
keyword: PBEPBE/SDD
title: #p freq=noraman PBEPBE/SDD
converged: YES YES NO NO
title: Mulliken charges:
elementType: O O C C C C C C C C C C C H H H H H H H H H H H H H H H H
charge: -0.274855 -0.434558 -0.241702 0.602010 -0.529262 -0.695030 -0.695197 -0.500146 0.158166 0.315307 -0.384184 -0.787573 -0.277790 0.206881 0.280825 0.217466 0.209107 0.225832 0.225862 0.210515 0.212717 0.232297 0.228902 0.234936 0.234983 0.213241 0.225830 0.227327 0.358093
chargesum: 0.00000
title: Mulliken charges with hydrogens summed into heavy atoms:
elementType: O O C C C C C C C C C C C
charge: -0.274855 -0.076465 -0.034820 0.602010 -0.248438 -0.042624 -0.046104 -0.267849 0.158166 0.315307 -0.155281 -0.104414 0.175368
polarizability: 1.56819482e+02 -2.43422830e+00 1.38524511e+02 6.66134023e-02 1.65887177e+00 8.48601486e+01
1716.lowfreq: -18.9315 -5.5737 -0.0007 -0.0006 -0.0005 7.0346 18.8413 58.2981 91.0386
frequency: 11.8898 58.2508 91.0235 95.8563 121.1162 144.0208 179.3544 214.0655 217.3955 240.5313 247.2731 282.9293 314.2198 370.4193 378.8633 408.4791 448.7845 463.5733 502.2236 540.5688 584.5787 639.7107 679.6982 722.9788 753.8061 826.7639 854.8310 882.8445 906.5525 916.6750 945.6142 948.3926 954.0680 956.0070 997.1769 1039.8527 1046.8513 1069.9534 1112.6655 1118.7841 1133.5520 1171.6215 1217.2985 1220.6659 1243.7361 1278.5847 1306.6050 1315.0986 1322.0406 1374.4889 1383.4165 1391.1106 1394.4679 1401.6552 1417.3537 1458.9077 1460.2523 1466.1745 1468.1701 1475.7565 1479.2659 1484.3123 1506.1809 1588.6883 1618.8269 2972.3864 2976.1553 2980.6725 2981.0936 3010.1287 3058.4130 3065.7318 3073.0917 3075.9797 3080.7758 3087.5830 3088.1866 3115.2278 3139.1096 3152.9028 3569.5681
redmass: 2.7964 4.6966 3.0716 4.0589 1.1080 2.4542 3.1891 1.1356 1.9934 3.1650 1.2370 2.9147 2.9962 2.0770 1.8294 2.7293 3.0169 3.0846 4.9169 3.2036 4.1157 4.4780 4.5752 2.6609 4.1796 1.3357 3.5371 1.5449 3.0394 1.1818 1.3745 5.7050 1.4669 2.7881 1.5553 1.6036 1.5192 1.6210 2.5401 2.6655 1.7125 1.6153 1.2957 1.6280 2.7127 1.4684 1.3262 1.2614 1.9574 1.2030 3.3726 1.3468 1.2224 1.2984 2.0056 1.0464 1.0833 1.0455 1.0511 1.1221 1.0537 1.1182 2.6582 6.2750 6.9597 1.0347 1.0359 1.0429 1.0765 1.0545 1.0969 1.1000 1.0993 1.1004 1.0996 1.1123 1.1005 1.0870 1.0964 1.0912 1.0658
irintensity: 0.0126 0.0493 3.0519 1.2226 0.0151 2.0550 0.9253 0.1901 2.0669 1.0804 0.3149 0.2532 3.0684 73.7596 104.8016 28.9264 16.0648 3.1567 2.6062 2.8204 54.0821 12.7096 2.4169 4.0682 8.0810 28.6409 5.3752 17.8648 23.9173 3.1289 6.2724 276.6989 1.2255 90.8084 22.3590 19.5190 7.4523 14.2307 2.0091 93.3796 10.9527 11.9779 7.6740 4.0138 51.7276 14.1416 0.8288 17.9309 22.3963 15.0960 4.4944 19.2147 17.2724 12.8101 20.3043 13.3097 9.6914 3.4629 2.2667 21.8629 8.7802 1.3527 68.5825 29.5234 20.7920 33.0830 37.3072 39.0433 15.0504 74.5520 20.2224 5.2139 97.0099 30.5563 40.2185 22.5090 24.6263 14.6427 28.8327 0.8668 11.1649
temp: 298.150 k
press: 1.00000 atm
elementType: 8 8 6 6 6 6 6 6 6 6 6 6 6 1 1 1 1 1 1 1 1 1 1 1 1 1 1 1 1
symmnumber: 1
zpe: 641759.9 jmol-1
zpe.correction: 0.244433 hartree
zpe.thermalcorrener: 0.258752 hartree
zpe.thermalcorrenthalpy: 0.259696 hartree
zpe.thermalcorrgfe: 0.202302 hartree
zpe.sumelectzpe: -578.206211 hartree
zpe.sumelectthermal: -578.191892 hartree
zpe.sumelectthermalent: -578.190948 hartree
zpe.sumelectthermalfe: -578.248342 hartree
dipole: 0.6894 0.4052 -0.0179
dipole: 0.7999
quadrupole: -71.5191 -75.6289 -78.9214
quadrupole: 4.9492 -0.9794 -0.2298
quadrupole: 3.8374 -0.2724 -3.5649 4.9492 -0.9794 -0.2298
hfenergy: -578.450644 hartree
pointgroup: C01 [X(C11H16O2)]
dipole: 0.2957331 -0.1075608 -0.0031693 debye
polarizability: 155.1988124|5.5458201|140.0297302|-3.3364418|0.4320475|84.9755987 unknown
InChI: InChI=1S/C11H16O2/c1-8(2)10-5-4-9(3)11(6-10)13-7-12/h4-6,8,12H,7H2,1-3H3
charge 0 multiplicity 1
29 atoms
O  2.255956 -0.472543 -0.133267
O  1.809339 -2.771013 0.536966
C  -2.792189 -0.418493 0.187836
C  -1.43697 0.292578 0.123641
C  -0.233476 -0.454419 0.03073
C  -2.899423 -1.339016 1.433073
C  -3.081318 -1.217553 -1.1112
C  -1.35258 1.703305 0.169164
C  1.010526 0.209175 -0.025422
C  1.112712 1.628192 0.029343
C  -0.095853 2.35266 0.127103
C  2.463982 2.311312 -0.022651
C  2.24465 -1.880278 -0.517145
H  -3.571788 0.364499 0.280991
H  -0.26587 -1.548227 0.044502
H  -2.147369 -2.148704 1.393237
H  -3.899672 -1.808587 1.485086
H  -2.733287 -0.769413 2.365179
H  -3.031568 -0.564774 -2.001354
H  -4.087276 -1.675909 -1.071003
H  -2.344929 -2.031773 -1.245847
H  -2.27084 2.298033 0.243631
H  -0.049235 3.447806 0.16519
H  3.095455 2.019995 0.837243
H  3.024039 2.02168 -0.930643
H  2.350065 3.408926 -0.01441
H  1.541818 -2.058246 -1.349046
H  3.291044 -2.06927 -0.818422
H  2.41376 -2.686843 1.317497
