program: Gaussian 09
title: 000239618
version: EM64L-G09RevD.01
frameworkgroup: C1[X(C22H30ClNO2)]
method: RPBEPBE
basis: SDD
operation: Freq
keyword: #p
keyword: freq=noraman
keyword: PBEPBE/SDD
title: #p freq=noraman PBEPBE/SDD
converged: YES YES NO NO
title: Mulliken charges:
elementType: Cl O O N C C C C C C C C C C C C C C C C C C C C C C H H H H H H H H H H H H H H H H H H H H H H H H H H H H H H
charge: -0.020527 -0.199561 -0.200827 -0.402878 -0.385238 -0.386649 -0.385527 -0.379645 -0.381682 -0.371081 -0.373195 -0.459984 -0.353137 -0.323986 -0.356807 -0.696316 0.585229 -0.137869 0.342088 -0.623659 0.290796 0.007975 -0.377699 -0.373979 -0.232440 -0.222101 0.194587 0.193911 0.195670 0.194663 0.194034 0.193443 0.194149 0.195164 0.192426 0.192022 0.200548 0.199149 0.189793 0.189445 0.213277 0.213542 0.187619 0.187861 0.241631 0.242020 0.194870 0.194740 0.322503 0.215282 0.209682 0.209708 0.289114 0.296464 0.240348 0.241033
chargesum: 0.00000
title: Mulliken charges with hydrogens summed into heavy atoms:
elementType: Cl O O N C C C C C C C C C C C C C C C C C C C C C C
charge: -0.020527 -0.199561 -0.200827 -0.080375 0.003260 0.003684 0.001951 0.009667 0.002767 0.028616 0.006042 -0.033164 0.022342 0.159665 0.032804 -0.061644 0.585229 -0.137869 0.342088 -0.623659 0.290796 0.007975 -0.088586 -0.077515 0.007908 0.018932
polarizability: 4.17387317e+02 5.98090292e+00 2.81815126e+02 6.49484492e+00 -1.45364258e+00 1.52080221e+02
1716.lowfreq: -5.8112 -0.0016 -0.0011 0.0009 2.7837 8.1390 9.5059 13.0780 23.8196
frequency: 9.4326 12.0568 23.7505 40.1547 43.8621 49.0295 63.8116 69.6392 78.6971 92.5375 98.1580 103.9368 105.2747 125.7162 126.9831 135.2586 147.8429 155.5058 157.6938 161.7701 179.7385 204.5656 224.3885 228.0695 253.4702 275.2488 283.6110 303.9621 334.9439 365.3989 376.1217 390.2757 415.8288 433.8275 441.0887 455.9608 478.0375 500.3599 512.9929 518.5024 582.8282 641.2944 656.3329 681.0944 702.1652 721.6337 723.4005 727.7603 729.4880 738.6363 758.1662 790.6958 797.1983 803.4414 835.1766 847.2989 855.7813 887.1162 887.6862 934.4212 941.6574 956.8568 982.7390 989.0933 991.6486 995.2347 1013.3380 1015.5038 1029.2260 1030.7307 1035.7621 1051.7038 1070.7325 1074.3486 1077.8420 1081.0356 1082.1235 1083.4766 1094.2804 1123.6978 1149.1473 1155.5009 1171.8878 1182.7379 1204.8479 1205.1249 1230.5942 1232.9284 1235.6512 1254.3221 1258.9320 1267.1079 1273.6921 1279.6406 1284.6525 1285.9575 1290.7950 1294.8113 1296.2917 1300.4270 1301.6918 1309.5877 1328.3204 1345.0349 1353.9550 1355.6485 1358.2952 1362.8692 1387.4578 1388.9423 1399.3203 1437.7464 1457.6766 1460.4435 1460.5980 1463.4364 1463.8416 1466.4048 1467.5967 1469.6021 1471.8494 1475.7002 1476.4265 1481.0142 1485.3065 1488.6658 1490.1595 1524.5284 1547.2262 1577.4770 1601.6431 1609.8095 2949.4945 2949.7918 2951.4628 2952.3822 2954.6732 2957.8895 2959.1501 2963.5589 2968.3270 2969.8501 2971.2315 2982.7712 2986.0264 2990.6611 2996.5202 3001.6737 3003.0139 3010.3380 3020.0089 3029.7113 3038.2730 3044.4385 3061.0761 3067.6927 3070.1406 3137.4225 3152.5659 3163.6492 3172.8586 3461.7206
redmass: 4.6573 5.1321 4.8135 2.8760 3.1983 2.4005 5.3105 1.9022 3.3703 4.0543 1.7271 3.8654 4.2019 1.9883 3.0911 3.0984 2.2547 2.1118 3.8280 2.6166 3.7737 7.8681 1.1381 3.8389 4.8273 6.6269 8.3617 4.2068 7.5726 6.8617 6.2834 3.5204 3.9792 3.9230 5.4987 3.7734 4.9098 3.2659 4.5985 3.1992 6.7009 1.4976 6.4337 4.3314 7.4641 1.0588 1.0654 1.1022 2.6797 1.1073 1.1358 1.1807 8.9516 1.7203 1.2169 7.9114 3.0332 1.8323 1.2601 1.7989 1.2149 7.4756 5.2493 4.4319 1.1696 1.3930 1.3603 4.1222 2.7153 1.0731 3.2964 3.1200 3.0074 2.7060 2.4136 2.3285 2.3482 2.3119 2.6945 3.0092 1.4758 2.6092 1.0927 1.8376 1.5197 1.3090 1.3786 1.5120 1.8666 1.2801 1.5019 2.1001 1.2007 1.0245 1.3773 1.0674 1.1315 1.0804 2.4066 1.1213 1.0989 1.3940 1.3758 1.4538 1.6597 1.6163 1.6388 1.6338 1.2171 8.3615 9.7773 2.3848 1.5090 1.0745 1.0860 1.0693 1.0863 1.1006 1.0774 2.3059 1.0907 1.0436 1.0828 1.0880 1.0930 1.0954 1.0996 10.7087 10.4958 4.9365 6.5796 6.3082 1.0586 1.0586 1.0591 1.0590 1.0594 1.0589 1.0592 1.0589 1.0586 1.0585 1.0366 1.0961 1.0971 1.0986 1.1001 1.0605 1.1002 1.1034 1.1046 1.1050 1.1049 1.1046 1.1049 1.1007 1.0993 1.0863 1.0903 1.0946 1.1002 1.0751
irintensity: 0.0948 0.1129 0.1743 0.3769 0.5450 0.7410 3.6729 0.3377 0.9993 0.1594 0.0120 0.7281 0.8198 0.0048 0.0434 0.3353 0.0222 0.0563 0.3212 0.0066 0.4744 0.7720 0.0024 0.8352 0.4450 0.0063 0.8513 1.6317 1.2716 6.3743 14.0321 1.1075 1.6794 0.0232 3.9206 2.8122 1.6185 0.2126 3.6413 2.2500 12.6912 85.1096 5.4225 23.9333 1.5270 18.1522 1.6907 3.0927 33.0236 0.3554 1.7077 0.3792 84.5753 39.7550 0.2201 0.0140 3.3076 4.7229 1.1093 0.1293 0.0983 34.1193 5.9248 1.6659 0.4180 4.1489 0.2100 4.9404 3.8476 0.0285 6.7121 0.6955 10.5784 6.9642 1.7369 0.1960 0.1688 1.7297 8.5639 26.8380 0.4426 37.7342 10.2891 0.0785 1.2509 26.1032 0.3542 23.4308 77.0319 0.1164 47.5834 132.6604 0.0161 0.1703 4.7680 0.3483 0.0798 0.2802 31.2364 0.1211 0.1757 20.1732 11.6096 11.0214 0.2448 1.9938 2.1407 8.5428 11.0776 165.8397 2.0472 10.9008 5.7866 0.1534 0.2081 1.5855 0.1862 7.4826 4.2620 0.2041 6.3880 12.1281 0.6521 5.0634 0.4735 3.4205 42.4699 99.0785 521.3765 202.9415 60.0501 92.2828 0.0031 0.1083 0.0542 0.2263 1.1021 1.2646 4.2673 30.4552 65.2484 240.0032 37.6524 0.0233 0.0223 0.0994 0.2490 16.1113 0.9819 0.7647 0.1225 5.1237 12.3380 254.0429 78.1533 100.6134 56.3743 4.7363 6.4215 1.4537 26.9276 64.2468
temp: 298.150 k
press: 1.00000 atm
elementType: 17 8 8 7 6 6 6 6 6 6 6 6 6 6 6 6 6 6 6 6 6 6 6 6 6 6 1 1 1 1 1 1 1 1 1 1 1 1 1 1 1 1 1 1 1 1 1 1 1 1 1 1 1 1 1 1
symmnumber: 1
zpe: 1238504.9 jmol-1
zpe.correction: 0.471722 hartree
zpe.thermalcorrener: 0.500077 hartree
zpe.thermalcorrenthalpy: 0.501022 hartree
zpe.thermalcorrgfe: 0.407542 hartree
zpe.sumelectzpe: -1519.637516 hartree
zpe.sumelectthermal: -1519.609160 hartree
zpe.sumelectthermalent: -1519.608216 hartree
zpe.sumelectthermalfe: -1519.701695 hartree
dipole: 3.1497 -3.1574 0.0619
dipole: 4.4602
quadrupole: -171.1183 -172.2751 -165.1816
quadrupole: 30.8792 0.3697 0.9492
quadrupole: -1.5933 -2.7501 4.3434 30.8792 0.3697 0.9492
hfenergy: -1520.1092375 hartree
pointgroup: C01 [X(C22H30Cl1N1O2)]
dipole: -1.2139746 1.1744795 -0.475573 debye
polarizability: 417.5989303|0.6736823|262.9436367|-6.7085152|-45.5474823|170.7400967 unknown
InChI: InChI=1S/C22H30ClNO2/c1-2-3-4-5-6-7-8-9-10-13-16-24-20-19(23)21(25)17-14-11-12-15-18(17)22(20)26/h11-12,14-15,24H,2-10,13,16H2,1H3
charge 0 multiplicity 1
56 atoms
Cl 3.762467 -3.107527 1.367487
O  3.181047 1.688798 -0.541852
O  6.658521 -2.342424 0.922421
N  2.122729 -0.751133 0.466697
C  -5.47918 -0.353759 0.228034
C  -4.144392 0.383171 -0.02366
C  -6.722941 0.489322 -0.13261
C  -2.903943 -0.466305 0.332894
C  -8.056091 -0.25321 0.11149
C  -1.567989 0.263577 0.06777
C  -9.301815 0.586403 -0.251186
C  -0.334745 -0.598158 0.417459
C  -10.634085 -0.159239 -0.011515
C  0.987816 0.1376 0.126069
C  -11.880598 0.679288 -0.375915
C  -13.206443 -0.075082 -0.136172
C  3.471511 -0.548621 0.332709
C  3.988342 0.762745 -0.21644
C  5.461294 0.925244 -0.356399
C  4.401224 -1.532613 0.696942
C  6.354907 -0.113758 0.022995
C  5.847274 -1.417251 0.583415
C  5.970659 2.140817 -0.878496
C  7.747509 0.070864 -0.123391
C  7.361398 2.319855 -1.023073
C  8.250463 1.283032 -0.644968
H  -5.536997 -0.653347 1.295562
H  -5.493197 -1.295583 -0.35975
H  -4.127984 1.323772 0.565684
H  -4.088599 0.683962 -1.090888
H  -6.713407 1.429073 0.458485
H  -6.663341 0.792831 -1.198978
H  -2.927616 -1.409958 -0.251305
H  -2.956544 -0.760419 1.402023
H  -8.116733 -0.556255 1.177928
H  -8.064334 -1.193512 -0.478893
H  -1.540469 1.204511 0.654922
H  -1.51924 0.559888 -1.000387
H  -9.296171 1.525492 0.341176
H  -9.240183 0.891682 -1.317008
H  -0.369783 -1.540838 -0.167147
H  -0.376205 -0.879785 1.490169
H  -10.640718 -1.098636 -0.603443
H  -10.698111 -0.464135 1.054255
H  1.042937 0.429898 -0.938207
H  1.050458 1.074768 0.708795
H  -11.874689 1.616883 0.216973
H  -11.81486 0.984927 -1.440316
H  1.868101 -1.668231 0.852391
H  -14.08136 0.545416 -0.404715
H  -13.250113 -1.000812 -0.740779
H  -13.310867 -0.364725 0.926701
H  5.261252 2.924409 -1.162333
H  8.409518 -0.746797 0.177577
H  7.754252 3.258599 -1.427249
H  9.331167 1.421684 -0.757151
