program: Gaussian 09
title: 000239616
version: EM64L-G09RevD.01
frameworkgroup: C1[X(C16H30N4O5)]
method: RPBEPBE
basis: SDD
operation: Freq
keyword: #p
keyword: freq=noraman
keyword: PBEPBE/SDD
title: #p freq=noraman PBEPBE/SDD
converged: YES YES NO NO
title: Mulliken charges:
elementType: O O O O O N N N N C C C C C C C C C C C C C C C C H H H H H H H H H H H H H H H H H H H H H H H H H H H H H H
charge: -0.316131 -0.314686 -0.302447 -0.305602 -0.288262 -0.068487 -0.068931 -0.148213 -0.149434 -0.357873 -0.360713 -0.358256 -0.361028 -0.377554 -0.376741 -0.378933 -0.377228 -0.613999 -0.613756 0.305353 0.310940 -0.301066 -0.300160 -0.244826 -0.243663 0.187939 0.215455 0.216678 0.192516 0.215762 0.190046 0.194028 0.216648 0.219787 0.252752 0.253317 0.224149 0.218442 0.254272 0.252796 0.222574 0.225357 0.190117 0.224201 0.190732 0.225047 0.224259 0.247927 0.230152 0.231117 0.241887 0.189343 0.233079 0.234685 0.196632
chargesum: 0.00000
title: Mulliken charges with hydrogens summed into heavy atoms:
elementType: O O O O O N N N N C C C C C C C C C C C C C C C C
charge: -0.316131 -0.314686 -0.302447 -0.305602 -0.288262 -0.068487 -0.068931 -0.148213 -0.149434 0.045522 0.048480 0.047552 0.049647 0.094986 0.100724 0.093780 0.098142 0.025676 0.026283 0.305353 0.310940 0.177014 0.172844 0.177597 0.187654
polarizability: 2.90765536e+02 6.83261785e+00 1.89889935e+02 2.55798701e+00 6.81650438e+00 1.87278157e+02
1716.lowfreq: -24.5553 -6.1283 -4.5607 -0.0016 0.0008 0.0016 5.7752 7.2015 8.6446
frequency: -20.1917 2.9145 8.3756 22.1158 32.3018 42.7567 54.5206 64.1195 88.0506 93.6754 97.1134 110.9974 112.6026 142.1319 149.6856 162.8326 164.0784 203.1963 219.6564 227.8187 251.0764 258.7330 272.8029 288.3965 301.1546 307.6912 323.1087 324.8737 341.3856 346.5835 372.5574 397.3968 403.0271 436.0089 438.5347 470.5904 473.5118 528.0536 546.7581 549.2862 571.2708 625.9193 630.1901 688.0196 690.4010 736.7132 737.4066 745.7969 746.4247 819.0253 827.1686 837.1283 839.1029 892.1566 900.1668 930.9470 939.0765 945.0294 1000.3584 1002.1982 1002.8848 1008.2921 1046.4743 1049.5724 1052.2059 1059.0683 1061.0312 1065.9607 1066.5040 1075.3354 1082.8770 1087.2984 1102.9612 1113.0236 1126.6377 1127.7112 1133.0229 1147.2922 1147.4654 1165.8146 1166.9731 1194.2467 1196.4133 1200.4086 1202.3656 1219.3769 1223.1148 1246.6269 1248.0628 1273.3921 1278.9138 1285.0858 1287.2221 1287.3312 1289.2053 1307.3187 1332.2221 1333.9901 1334.2107 1349.6025 1352.1142 1359.5887 1362.6060 1367.8208 1368.5617 1373.2682 1401.9929 1410.1579 1415.4907 1431.2327 1432.0148 1452.0493 1454.3488 1455.1174 1457.1687 1457.6322 1458.7768 1460.4432 1461.3227 1464.2999 1465.6037 1472.6341 1473.5748 1480.8892 1481.4876 1481.8776 1497.0038 1645.3271 1648.4239 2843.6524 2846.6816 2850.3355 2852.5162 2868.7349 2869.9584 2940.9300 2948.0328 2980.5183 2980.7821 2984.0247 2984.0624 3007.0589 3017.5637 3020.5475 3021.4263 3031.7877 3032.4169 3036.7434 3037.9261 3043.5795 3045.6717 3078.3388 3079.2469 3096.8713 3098.8647 3120.0750 3120.7299 3123.7868 3125.2877
redmass: 3.8756 4.5149 4.0271 4.4518 4.8514 4.4386 2.4498 4.9931 4.0399 6.4982 3.6652 3.8648 4.0866 3.8766 2.9192 3.0153 3.0868 2.5290 1.3210 1.2734 2.0038 2.1586 4.0958 3.0487 2.5301 2.7242 2.7688 2.6533 3.3066 3.1275 3.5991 2.0296 2.1426 3.8208 4.8993 2.6788 2.7024 5.1237 4.2758 3.6416 3.7649 2.4787 2.6119 11.4266 11.0306 4.2106 4.2322 3.0759 3.0699 1.2517 1.2394 1.5805 1.5730 4.4014 3.4757 3.0256 2.3362 3.1943 3.9406 2.5428 2.5298 3.8233 2.3334 1.8668 2.0715 2.4683 3.9757 1.8183 1.7684 2.7473 1.8583 2.1909 2.1642 1.8963 1.6928 1.7491 1.6931 2.5640 2.5583 2.4871 2.5552 1.1803 1.1069 1.0964 1.2045 1.7412 1.7915 3.9608 3.8931 1.1092 1.1207 1.5528 1.5192 1.4726 1.4585 1.1914 1.2519 1.2488 1.2553 1.3564 1.3393 1.3379 1.3470 1.4819 1.4647 1.3301 1.7749 2.4533 1.9597 1.1670 1.1690 1.0791 1.0991 1.0824 1.0812 1.0880 1.0798 1.0878 1.0886 1.0966 1.1066 1.0981 1.0985 1.0528 1.0834 1.0530 1.0768 9.3999 9.4037 1.0708 1.0708 1.0661 1.0656 1.0598 1.0600 1.0577 1.0583 1.0686 1.0687 1.0675 1.0677 1.1050 1.1033 1.0734 1.0735 1.0884 1.0883 1.0904 1.0899 1.0578 1.0575 1.1009 1.1010 1.0958 1.0956 1.0936 1.0935 1.1089 1.1090
irintensity: 0.4473 0.3332 0.8346 0.1171 0.4941 0.5711 2.3752 0.8057 2.3401 4.2843 1.3297 3.1977 2.2930 0.8446 1.5640 2.6316 0.7480 2.9599 0.7313 0.2680 2.2239 12.2483 22.4185 3.9375 5.0712 16.9359 10.6692 9.8739 1.9388 10.6238 13.5822 1.2414 1.0501 12.5254 0.9881 0.0633 0.0262 7.0507 12.1152 4.3529 0.6150 1.8786 1.5265 17.4318 22.7634 15.0173 10.3961 14.5489 13.6644 1.0846 1.4787 0.9796 0.9168 8.7226 9.6210 7.1435 7.5236 5.6920 171.0770 70.7643 33.6949 29.2955 11.5211 33.2521 27.2631 47.3100 419.2233 36.7928 11.9197 47.1392 19.9441 37.0676 8.3132 19.2202 65.9347 26.4707 1.1551 75.5376 38.6598 7.5072 8.7111 83.8519 8.8516 8.4849 24.6691 328.0746 123.4490 46.6679 41.6352 4.3095 0.6250 45.4824 40.0536 21.9466 31.4980 4.5751 0.6285 10.8018 1.1757 2.9015 4.7485 1.2789 15.0970 1.2067 0.7430 0.6465 42.9440 186.0809 54.8770 3.6374 3.0524 0.6625 50.6947 7.3272 34.6030 51.0475 21.6380 0.9344 9.8576 39.3810 24.0726 9.2072 10.0470 8.5751 8.7389 8.9504 4.2533 491.2552 366.8789 52.2670 51.5064 54.3127 48.5140 194.6295 210.5985 26.6971 71.9770 19.1504 22.1598 107.0432 31.8656 36.7529 16.6941 48.0111 46.8703 51.8759 53.1914 51.0197 50.4745 23.5864 37.9226 32.7421 32.8811 5.5492 5.6840 5.1868 5.3961 11.1748 13.9799
temp: 298.150 k
press: 1.00000 atm
elementType: 8 8 8 8 8 7 7 7 7 6 6 6 6 6 6 6 6 6 6 6 6 6 6 6 6 1 1 1 1 1 1 1 1 1 1 1 1 1 1 1 1 1 1 1 1 1 1 1 1 1 1 1 1 1 1
symmnumber: 1
zpe: 1225236.0 jmol-1
zpe.correction: 0.466668 hartree
zpe.thermalcorrener: 0.492881 hartree
zpe.thermalcorrenthalpy: 0.493825 hartree
zpe.thermalcorrgfe: 0.404394 hartree
zpe.sumelectzpe: -1220.790903 hartree
zpe.sumelectthermal: -1220.764690 hartree
zpe.sumelectthermalent: -1220.763745 hartree
zpe.sumelectthermalfe: -1220.853176 hartree
dipole: -0.9946 1.6603 -3.6039
dipole: 4.0907
quadrupole: -102.9728 -147.3155 -154.8989
quadrupole: 11.5681 -6.2340 2.8374
quadrupole: 32.0896 -12.2531 -19.8365 11.5681 -6.2340 2.8374
hfenergy: -1221.2575708 hartree
pointgroup: C01 [X(C16H30N4O5)]
dipole: -0.1825618 1.5962001 0.0950453 debye
polarizability: 285.8271175|-14.1635834|185.2280254|17.4509673|-6.9746229|196.8784854 unknown
InChI: InChI=1S/C16H30N4O5/c1-17-3-7-19(8-4-17)15(21)24-13-11-23-12-14-25-16(22)20-9-5-18(2)6-10-20/h3-14H2,1-2H3
charge 0 multiplicity 1
55 atoms
O  4.045504 -0.518225 -1.170155
O  -3.192555 0.659985 -1.530464
O  3.751868 -2.392109 0.229399
O  -3.422836 -0.429369 0.545775
O  0.373861 -0.331191 -1.686096
N  7.683382 0.037464 2.067212
N  -7.720013 1.94438 -0.17531
N  5.696936 -1.081779 0.337449
N  -4.952326 1.212146 -0.148525
C  6.991249 0.891078 1.07197
C  6.786656 -1.03822 2.555754
C  -6.938538 1.922179 -1.435605
C  -7.228103 0.911136 0.769281
C  6.523344 0.048459 -0.13167
C  6.320492 -1.919302 1.382202
C  -5.444944 2.178733 -1.150357
C  -5.742334 1.149429 1.097531
C  8.2775 0.821542 3.167036
C  -9.173122 1.843702 -0.412519
C  4.455577 -1.416892 -0.153254
C  -3.838734 0.41673 -0.294231
C  2.716848 -0.806573 -1.760506
C  -2.011461 -0.195351 -1.79882
C  1.618695 -0.120493 -0.940433
C  -0.776267 0.326308 -1.054081
H  6.10524 1.411984 1.520007
H  7.696822 1.665419 0.717215
H  7.343073 -1.66313 3.278751
H  5.888657 -0.621417 3.081069
H  -7.319753 2.716911 -2.103665
H  -7.045771 0.942574 -1.969943
H  -7.349803 -0.121995 0.352659
H  -7.819042 0.973163 1.701903
H  7.41464 -0.348522 -0.65839
H  5.936038 0.657774 -0.833045
H  5.581578 -2.666472 1.712658
H  7.197305 -2.443751 0.952562
H  -5.328515 3.206356 -0.750696
H  -4.847991 2.082029 -2.068153
H  -5.337611 0.338015 1.723003
H  -5.641589 2.110832 1.639684
H  8.83742 0.148975 3.841251
H  7.520403 1.373558 3.779775
H  8.988106 1.560543 2.755307
H  -9.478841 0.880889 -0.894909
H  -9.712581 1.930893 0.54756
H  -9.501647 2.672398 -1.06504
H  2.548433 -1.895738 -1.792708
H  2.760937 -0.38915 -2.778358
H  -1.857851 -0.120713 -2.88669
H  -2.229084 -1.236746 -1.508854
H  1.836082 0.965217 -0.839064
H  1.550216 -0.57353 0.070101
H  -0.837705 0.071827 0.022915
H  -0.699742 1.42994 -1.165486
