program: Gaussian 09
title: 000239615
version: EM64L-G09RevD.01
frameworkgroup: C1[X(C4H5N5O3)]
method: RPBEPBE
basis: SDD
operation: Freq
keyword: #pfreq=noraman
keyword: PBEPBE/SDD
title: #p freq=noraman PBEPBE/SDD
converged: YES YES YES YES
title: Mulliken charges:
elementType: O O O N N N N N C C C C H H H H H
charge: -0.181953 -0.315755 -0.155787 -0.443056 -0.035958 -0.649000 0.049593 -0.621246 0.391502 0.061804 0.178913 0.029459 0.307975 0.310741 0.393390 0.314287 0.365090
chargesum: 0.00000
title: Mulliken charges with hydrogens summed into heavy atoms:
elementType: O O O N N N N N C C C C
charge: -0.181953 -0.315755 -0.155787 -0.135081 -0.035958 0.055131 0.049593 0.058131 0.391502 0.061804 0.178913 0.029459
polarizability: 1.35739036e+02 1.11786381e+01 1.18663459e+02 -7.87144738e-04 4.97223361e-03 3.65269067e+01
1716.lowfreq: -52.8199 -9.1851 -6.0239 -0.0010 -0.0009 -0.0008 4.6903 68.5522 136.5175
frequency: -52.8131 68.5509 136.5142 175.3719 194.0697 260.0258 262.8079 327.6765 369.0510 377.1037 379.8821 410.4339 500.1408 532.0536 554.7503 580.5769 623.6518 637.9874 641.8644 668.4851 690.1943 759.9531 763.3341 875.7246 932.6494 950.4512 1051.9505 1094.1501 1159.8172 1183.3483 1199.7824 1315.4452 1354.1098 1413.6255 1486.2979 1505.3842 1596.8727 1605.8028 1624.3000 1670.4143 3114.4061 3525.1919 3549.2785 3602.8470 3698.8579
redmass: 7.2498 7.1816 2.9892 4.3792 1.5309 7.0601 6.4709 4.5023 9.2069 1.1862 3.7092 9.3216 9.4492 1.1725 1.2102 6.7696 4.9773 9.9295 7.2794 9.6834 9.9243 11.0639 10.0972 1.0940 5.8984 2.2619 5.3744 2.0145 7.7243 2.8539 6.3993 1.9442 5.2974 4.7802 4.2776 1.4226 9.6829 1.3107 3.3714 4.5062 1.0674 1.0775 1.0460 1.0865 1.1052
irintensity: 3.0607 0.7581 4.5276 6.0944 46.4959 0.4226 1.3326 2.2411 1.1317 0.3135 10.1568 0.2031 0.4603 554.5173 0.0173 3.2427 2.8618 0.3410 12.5071 0.2900 8.6093 16.9482 7.3261 147.7684 61.1707 35.0985 86.3693 9.3624 76.5504 53.8921 106.2227 148.8047 108.1496 218.5709 116.8253 6.7778 523.1680 57.0527 486.2934 596.0504 163.2963 13.6975 120.3620 61.4827 47.1191
temp: 298.150 k
press: 1.00000 atm
elementType: 8 8 8 7 7 7 7 7 6 6 6 6 1 1 1 1 1
symmnumber: 1
zpe: 295628.3 jmol-1
zpe.correction: 0.112599 hartree
zpe.thermalcorrener: 0.122637 hartree
zpe.thermalcorrenthalpy: 0.123581 hartree
zpe.thermalcorrgfe: 0.077225 hartree
zpe.sumelectzpe: -653.901329 hartree
zpe.sumelectthermal: -653.891291 hartree
zpe.sumelectthermalent: -653.890347 hartree
zpe.sumelectthermalfe: -653.936703 hartree
dipole: 9.0828 9.8501 0.0018
dipole: 13.3986
quadrupole: -61.8537 -68.2131 -69.6397
quadrupole: 5.4906 0.0030 0.0033
quadrupole: 4.7151 -1.6443 -3.0708 5.4906 0.0030 0.0033
hfenergy: -654.013928 hartree
pointgroup: C01[X(C4H5N5O3)]
dipole: -3.5120112 3.9310858 -0.0007142 debye
dipolederiv: -0.5281608 0.1555272 -0.00017 0.174918 -1.0121728 0.0003407 -0.0000403 0.0001292 -0.337191 -0.7697089 -0.1876121 0.0000027 -0.3791191 -0.8067658 -0.0002213 0.000102 0.0000163 -0.3225229 -0.6468002 0.2901372 0.0001084 0.3034572 -0.5878314 -0.0000975 0.0002622 -0.0003831 -0.1883047 -1.269271 -0.260472 0.000052 -0.314232 -0.6526632 0.0000527 -0.0000358 0.0000188 -0.2574242 -1.3798909 0.3508747 -0.0001764 0.5549616 -0.8145057 0.0001834 -0.0003185 0.0001466 -0.3100107 -0.4890252 -0.3022222 -0.0000317 -0.1612421 -1.186266 0.0000269 -0.0000161 -0.0000907 -0.6138963 1.8092831 -0.1156232 -0.0002081 -0.067097 1.0376043 0.0004446 -0.0003217 0.000496 0.2120876 -1.5954421 0.1694637 -0.0000726 0.0923201 -0.2563537 -0.0000371 -0.0001076 -0.0000314 -0.7487746 1.2694063 0.1589826 -0.0000802 -0.3622981 1.4321021 -0.0001499 -0.0001702 -0.0002878 0.2478978 -1.2037346 0.1217556 0.000099 0.1679674 -0.8619528 0.0000256 0.0001013 0.000107 -0.099111 2.0902426 -0.1277114 0.0002671 -0.1249847 1.2826554 -0.0001765 0.0003274 -0.0000485 0.2611235 1.5213671 -0.2007436 0.0002482 0.0281994 1.4364453 -0.0005269 0.0002088 -0.0003809 0.2616667 0.1486325 -0.0297319 -0.0000009 -0.0289266 0.0648062 0.0000164 0.0000083 0.0000353 0.3370858 0.1396719 0.0982339 0.000024 0.0609338 0.2447938 0.0000533 0.0000314 0.0001285 0.3837095 0.3724821 -0.1525994 0.0000097 -0.014587 0.3708127 0.0000013 0.000048 0.0000737 0.3695192 0.2425439 -0.006423 -0.0000395 -0.024371 0.1269697 0.0000322 -0.000039 0.0000455 0.4019619 0.2884041 0.038164 -0.0000318 0.0941001 0.1823221 0.0000322 -0.0000401 0.0000255 0.4021833 unknown
polarizability: 135.3829512|-11.4418314|119.019544|-0.0008653|-0.0049592|36.5269067 unknown
InChI: InChI=1S/C4H5N5O3/c5-2-1(9(11)12)3(10)8-4(6)7-2/h7H,5-6H2
charge 0 multiplicity 1
17 atoms
O  0.324386 -2.450065 0.000711
O  2.735303 1.10538 0.000172
O  2.697978 -1.165524 -0.000657
N  -1.43523 1.250974 0.000168
N  -1.59681 -1.144435 0.000261
N  0.589516 2.447241 -0.0002
N  2.065406 -0.054308 0.000158
N  -3.536616 0.161163 -0.000159
C  -0.041012 1.241943 0.000098
C  0.620776 -0.019785 0.000234
C  -2.162709 0.039484 0.000101
C  -0.172168 -1.296253 0.000614
H  -1.9199 2.150798 0.000142
H  0.087531 3.333866 -0.000399
H  1.632286 2.359097 -0.000585
H  -4.033731 1.047816 -0.00037
H  -4.062306 -0.710493 -0.000188
