program: Gaussian 09
title: 000239613
version: EM64L-G09RevD.01
frameworkgroup: C1[X(C9H13NO2)]
method: RPBEPBE
basis: SDD
operation: Freq
keyword: #p
keyword: freq=noraman
keyword: PBEPBE/SDD
title: #p freq=noraman PBEPBE/SDD
converged: NO YES NO NO
title: Mulliken charges:
elementType: O O N C C C C C C C C C H H H H H H H H H H H H H
charge: -0.264409 -0.254846 -0.032050 -0.520812 -0.355236 0.369239 -0.680524 -0.799329 0.039873 0.173290 -0.217527 -0.500885 0.248082 0.215307 0.233095 0.201430 0.225431 0.209218 0.223933 0.223483 0.283463 0.253485 0.242721 0.241690 0.241877
chargesum: 0.00000
title: Mulliken charges with hydrogens summed into heavy atoms:
elementType: O O N C C C C C C C C C
charge: -0.264409 -0.254846 -0.032050 -0.057423 0.079288 0.369239 -0.021941 -0.038898 0.039873 0.173290 -0.217527 0.225404
polarizability: 1.47014308e+02 7.88843818e+00 1.24357337e+02 3.85470581e+00 4.73993331e-01 7.17152080e+01
1716.lowfreq: -31.1692 -11.4437 -0.0005 0.0003 0.0004 5.3265 11.1603 41.5299 57.9322
frequency: -30.3287 41.4247 57.8878 65.6148 86.7593 111.2871 139.4187 141.8008 179.3043 189.8662 238.5022 277.0348 279.3808 307.5646 343.0584 401.4240 458.4437 501.0891 512.7110 577.6988 626.9224 744.6812 748.7701 749.9151 849.0112 876.8623 896.4316 961.3262 1004.2509 1026.3109 1049.0890 1069.2468 1090.7831 1114.0488 1142.0129 1152.2141 1211.2458 1224.9847 1269.3938 1282.6759 1293.0068 1326.2997 1392.0956 1394.4252 1423.0692 1445.5261 1454.1750 1456.7678 1462.0326 1470.1240 1475.5366 1479.0447 1488.4682 1589.9101 1618.1274 2171.6615 2974.8653 2978.0519 2983.1218 2990.9549 3004.9745 3035.0700 3055.9374 3062.3898 3078.2483 3082.1500 3106.4071 3122.7553 3154.3183
redmass: 1.6180 5.2207 3.3220 2.3328 1.7020 1.1267 4.4232 3.7261 3.0408 3.1340 1.1635 5.7722 3.3150 3.9913 3.6037 3.2611 3.5431 7.2338 6.4695 5.3737 5.1119 5.7658 2.6778 1.5274 2.6914 1.3879 2.7392 2.5790 1.4554 1.8007 3.1098 3.1650 2.1606 1.2643 2.1962 1.6180 5.8016 1.4843 1.3129 2.0932 1.4370 1.3654 1.2013 1.1846 1.1884 1.0965 1.0498 1.0794 1.0520 1.0823 1.0578 1.0543 1.0900 6.4775 8.7794 12.6326 1.0437 1.0359 1.0590 1.0618 1.0298 1.0986 1.0903 1.1014 1.1004 1.1011 1.1046 1.0986 1.1045
irintensity: 1.2355 4.0850 0.6829 0.3051 0.5730 0.4760 2.2727 2.2424 1.9427 3.2805 0.0558 5.1054 0.4077 16.8612 0.9980 7.2396 1.5009 0.8111 0.4089 2.4765 5.6424 7.1595 8.6079 2.1019 6.5154 3.4616 3.6953 10.5874 25.9798 27.5037 1.8347 155.3410 12.1732 0.0249 13.9317 43.4779 222.8998 0.4147 4.3513 30.8046 28.8695 4.6672 7.9904 38.5566 25.0318 26.6146 15.8131 14.9759 11.6255 1.2855 2.0834 13.4659 19.9558 143.6448 175.7099 20.3534 5.1430 34.1689 9.8985 39.9564 33.9082 1.5432 17.2365 4.9607 50.2944 52.8643 25.6858 1.9019 13.0075
temp: 298.150 k
press: 1.00000 atm
elementType: 8 8 7 6 6 6 6 6 6 6 6 6 1 1 1 1 1 1 1 1 1 1 1 1 1
symmnumber: 1
zpe: 529766.0 jmol-1
zpe.correction: 0.201777 hartree
zpe.thermalcorrener: 0.215424 hartree
zpe.thermalcorrenthalpy: 0.216369 hartree
zpe.thermalcorrgfe: 0.160644 hartree
zpe.sumelectzpe: -555.007365 hartree
zpe.sumelectthermal: -554.993718 hartree
zpe.sumelectthermalent: -554.992774 hartree
zpe.sumelectthermalfe: -555.048498 hartree
dipole: -0.9080 -3.0293 0.3380
dipole: 3.1805
quadrupole: -56.2977 -85.3531 -70.7273
quadrupole: 5.7016 1.6164 2.7282
quadrupole: 14.4950 -14.5604 0.0654 5.7016 1.6164 2.7282
hfenergy: -555.2091424 hartree
pointgroup: C01 [X(C9H13N1O2)]
dipole: -0.3076001 1.1616957 0.3486884 debye
dipolederiv: -1.3026455 0.2426642 0.3264942 0.4846817 -0.5894446 -0.2384986 0.469541 -0.191424 -0.47163 -0.7547366 -0.2375016 -0.0040021 -0.1268389 -0.8407622 -0.2060779 0.0456167 -0.1576757 -0.3874938 -0.2521037 -0.0460187 -0.0165835 -0.0201297 -0.3925076 -0.0315956 -0.0075127 -0.0348927 -0.2564157 -0.3935413 -0.0508528 -0.0888598 0.0284392 0.0128437 -0.0120607 -0.3165266 0.052932 0.0626734 0.1298226 -0.019714 0.0466138 -0.1609073 0.1642926 0.0220674 0.2955749 -0.0145651 0.1050475 0.756084 -0.1529758 -0.1118256 -0.235864 0.3978004 0.2757399 -0.3122178 0.2267152 0.1206477 -0.0574927 -0.0294088 -0.0143027 0.0165985 0.0590956 0.0149938 -0.1401212 0.0278789 0.0698114 0.0078645 -0.0866528 -0.0252277 -0.0561591 -0.245954 -0.1281831 0.1191008 -0.2292455 -0.1264193 -0.8506292 0.1351746 0.178881 0.1057261 -0.2040176 -0.0999511 0.2587472 -0.1026927 -0.0795102 1.8430106 0.0058452 -0.3320576 -0.1406205 1.0725142 0.3978357 -0.4619411 0.3472015 0.517294 0.0131659 0.0557402 0.0249913 0.0368902 0.3184092 0.0731127 0.0235003 0.0833952 0.0590137 0.7238705 -0.0649649 -0.1303616 -0.001101 0.2213798 -0.0221694 -0.1183937 -0.0081749 0.3021004 0.0524825 0.0050061 -0.0156036 -0.0202649 -0.089798 0.0451127 0.0119875 -0.0106088 0.07062 0.0121025 0.039348 0.0822523 -0.0015117 0.0555885 -0.0854402 0.0912632 -0.0593406 -0.0802692 -0.0114732 0.0247387 0.0824349 0.0238907 0.0490851 -0.0761642 0.05096 -0.0393477 -0.0775324 0.0423564 -0.0330016 -0.0161402 -0.0105719 -0.1764489 0.0527987 -0.0078055 0.0110096 0.0618299 -0.0860339 0.0250608 -0.1074142 0.0162412 0.0877205 0.0529597 -0.1383009 0.0466592 -0.0644822 0.0220906 0.0119817 0.0645959 0.0437106 0.0457878 -0.0948777 0.1389995 -0.0814883 -0.0882882 0.072452 0.029835 0.0021597 -0.0436372 -0.1505789 0.028001 0.0239715 0.0303215 0.0923249 -0.0928807 0.1188921 -0.006269 0.092878 0.0296963 -0.0123815 -0.0311438 0.0446495 0.1205218 0.0767957 -0.0652873 0.0517627 -0.0424392 0.0677267 0.0177089 0.0366828 0.0656605 0.0874402 0.0994362 0.0077492 -0.0396936 0.0520042 0.0554287 0.0022476 -0.0336804 -0.0025212 -0.0513735 -0.0517404 0.0086189 -0.0079568 -0.0706142 0.097683 -0.0283988 -0.0903958 -0.0218484 -0.0771064 -0.0226016 0.0339814 0.0157762 -0.0690937 -0.0214326 0.13366 0.0290374 0.0848322 0.0089072 0.0243446 0.0417423 0.0403361 0.0986927 -0.0241078 -0.0804394 0.0630568 -0.0674297 0.0822891 unknown
polarizability: 145.5353139|-5.1702143|116.8232902|-10.8188103|19.2721603|80.7282482 unknown
InChI: InChI=1S/C9H13NO2/c1-4-5-7(2)8(6-10)9(11)12-3/h4-5H2,1-3H3
charge 0 multiplicity 1
25 atoms
O  2.548263 -0.397746 -0.811689
O  2.192276 1.695171 0.142607
N  -0.145757 -2.409616 -0.818759
C  -2.08306 0.241917 0.583933
C  -2.965467 0.611936 -0.650904
C  -0.687359 0.823916 0.472356
C  -4.407627 0.086303 -0.496302
C  -0.5348 2.253055 0.936914
C  0.352266 0.064484 -0.048151
C  1.748937 0.570714 -0.204092
C  0.100438 -1.290684 -0.473606
C  3.967932 -0.026189 -1.014483
H  -2.054324 -0.85874 0.673754
H  -2.570763 0.645424 1.493186
H  -2.502808 0.183805 -1.560077
H  -2.977611 1.711786 -0.783193
H  -5.019334 0.347674 -1.378553
H  -4.8975 0.518081 0.396594
H  -4.418797 -1.014123 -0.391357
H  -1.501052 2.781914 0.861559
H  0.250746 2.800691 0.396504
H  -0.237948 2.264624 2.005643
H  4.441295 0.2130 -0.0473
H  4.041588 0.849307 -1.681359
H  4.42317 -0.914702 -1.472526
