program: Gaussian 09
title: 000239605
version: EM64L-G09RevD.01
frameworkgroup: C1[X(C14H12O2S)]
method: RPBEPBE
basis: SDD
operation: Freq
keyword: #p
keyword: freq=noraman
keyword: PBEPBE/SDD
title: #p freq=noraman PBEPBE/SDD
converged: YES YES NO NO
title: Mulliken charges:
elementType: S O O C C C C C C C C C C C C C C H H H H H H H H H H H H
charge: 0.213949 -0.426239 -0.222059 -0.725774 0.550463 -0.419518 -0.355663 -0.172920 0.256142 -0.222323 -0.225539 -0.238436 -0.274988 -0.207511 -0.207312 -0.227516 -0.234280 0.327778 0.232372 0.276027 0.228185 0.228299 0.230452 0.253617 0.287546 0.231534 0.230087 0.231732 0.381894
chargesum: 0.00000
title: Mulliken charges with hydrogens summed into heavy atoms:
elementType: S O O C C C C C C C C C C C C C C
charge: 0.213949 -0.044345 -0.222059 -0.397996 0.550463 -0.187146 -0.079636 -0.172920 0.256142 0.005862 0.002760 -0.007984 -0.021371 0.080035 0.024223 0.002571 -0.002547
polarizability: 2.46984393e+02 4.39265729e+00 1.61026281e+02 2.44147131e+01 -2.42508867e-01 1.22541503e+02
1716.lowfreq: -11.7597 -0.5690 -0.0024 -0.0008 0.0010 8.4658 22.4089 32.5251 43.1515
frequency: 21.5704 32.3055 42.9151 58.1632 75.2825 97.4303 144.7566 164.9681 200.9315 240.7305 279.1264 313.1974 342.2631 395.7226 401.6938 407.4016 475.2051 488.9129 532.8422 574.2471 609.5266 614.8597 633.8717 662.4844 675.0951 696.6553 701.2659 722.4477 751.1088 785.8367 826.0801 851.5718 853.9893 896.1405 923.6150 933.1523 979.1001 979.6927 984.1216 989.9561 996.0839 999.3002 1016.1170 1028.4972 1039.8154 1069.2687 1076.5975 1086.6988 1171.3132 1172.1907 1173.6318 1190.5185 1194.8040 1200.6018 1245.0806 1310.0066 1320.8791 1355.5402 1372.6676 1387.2880 1425.5171 1444.5967 1461.4428 1483.6579 1583.2259 1587.1210 1591.2288 1611.6831 1663.9520 3092.5688 3120.0471 3127.4568 3130.8005 3136.3052 3144.5739 3148.7343 3156.5249 3160.7622 3168.0965 3174.1772 3514.6767
redmass: 5.6481 4.0926 4.1144 8.8416 6.2775 7.0215 7.7023 5.3349 5.1298 5.6454 5.4656 6.7461 7.4918 6.3217 2.8254 3.4904 3.5755 4.0027 3.4689 3.1999 6.2432 6.2985 1.8515 4.3622 5.9696 2.3847 1.8305 3.4240 1.4756 2.2780 5.0161 1.2453 1.2521 4.8042 1.3592 1.5606 1.4149 1.4149 5.5694 5.6204 1.3079 1.3259 3.5128 2.3656 2.2060 2.3600 1.6512 1.6124 1.1984 1.0542 1.0667 1.1312 1.1135 1.5578 1.9068 1.3476 1.5510 1.7897 7.8741 5.6567 2.1343 2.1777 2.0038 2.2955 6.1470 5.7997 5.9798 6.0181 8.5386 1.0863 1.0870 1.0848 1.0877 1.0883 1.0932 1.0927 1.0965 1.0978 1.1017 1.0978 1.0640
irintensity: 0.5240 0.1864 0.2634 2.1183 0.3035 0.2126 1.7085 0.5115 2.5883 0.6341 0.4557 0.8018 3.3263 0.0806 0.0460 0.9569 10.7391 5.5185 12.1736 51.0099 2.5608 2.4364 158.1496 32.7079 9.5574 33.6889 57.4284 1.7779 85.3915 28.6511 13.4976 0.3054 0.2310 20.4750 3.0418 1.4931 1.0947 0.1023 2.6526 2.2614 0.7622 0.5526 18.6601 13.6948 233.8583 11.2500 5.5529 10.0989 15.5916 0.0508 1.0994 3.4225 1.6225 2.7496 5.2535 4.0445 11.2554 19.4479 0.1826 2.8029 10.2825 13.1441 44.5892 17.5520 1.9513 31.0807 0.6207 0.9980 235.8476 0.9920 5.9332 0.6830 2.1560 10.3940 29.5063 9.7177 13.1098 25.1097 29.0795 9.9726 31.7006
temp: 298.150 k
press: 1.00000 atm
elementType: 16 8 8 6 6 6 6 6 6 6 6 6 6 6 6 6 6 1 1 1 1 1 1 1 1 1 1 1 1
symmnumber: 1
zpe: 578360.3 jmol-1
zpe.correction: 0.220286 hartree
zpe.thermalcorrener: 0.235580 hartree
zpe.thermalcorrenthalpy: 0.236525 hartree
zpe.thermalcorrgfe: 0.175004 hartree
zpe.sumelectzpe: -1088.000588 hartree
zpe.sumelectthermal: -1087.985294 hartree
zpe.sumelectthermalent: -1087.984349 hartree
zpe.sumelectthermalfe: -1088.045870 hartree
dipole: -1.4000 -1.0222 -2.0096
dipole: 2.6539
quadrupole: -95.7879 -96.7391 -106.8033
quadrupole: -4.2039 3.6102 -3.9990
quadrupole: 3.9888 3.0377 -7.0265 -4.2039 3.6102 -3.9990
hfenergy: -1088.220874 hartree
pointgroup: C01 [X(C14H12O2S1)]
dipole: 0.475781 0.3834227 -0.8466632 debye
polarizability: 243.2297827|12.0031418|162.4055795|-28.6928584|-7.1699827|124.9168147 unknown
InChI: InChI=1S/C14H12O2S/c15-14(16)13(11-7-3-1-4-8-11)17-12-9-5-2-6-10-12/h1-10,13,15H
charge 0 multiplicity 1
29 atoms
S  0.536993 -0.24365 1.462412
O  0.46784 -3.047976 -0.567297
O  -1.311807 -3.131556 0.919316
C  -0.550542 -0.947481 -0.010872
C  -1.896705 -0.262886 -0.053908
C  -2.09166 0.776047 -1.002164
C  -2.953732 -0.593341 0.835056
C  2.034212 0.341061 0.556657
C  -0.557564 -2.452581 0.191515
C  -3.317263 1.473247 -1.064795
C  -4.17799 0.106797 0.770581
C  -4.36568 1.140876 -0.17608
C  2.514996 1.639238 0.854946
C  2.722504 -0.485267 -0.364748
C  3.696827 2.106575 0.235108
C  3.888678 0.00216 -0.997997
C  4.383007 1.29326 -0.696603
H  0.045313 -0.712184 -0.904786
H  -1.278788 1.040777 -1.689632
H  -2.817763 -1.401383 1.559489
H  -3.453907 2.270644 -1.80366
H  -4.987993 -0.156284 1.45998
H  -5.318003 1.680973 -0.221485
H  1.964997 2.276966 1.55496
H  2.356416 -1.495585 -0.576977
H  4.069551 3.109558 0.470641
H  4.417443 -0.635614 -1.715208
H  5.292929 1.661665 -1.182874
H  0.478594 -4.026355 -0.382376
