program: Gaussian 09
title: 000239601
version: EM64L-G09RevD.01
frameworkgroup: C1[X(C9H11NO2S)]
method: RPBEPBE
basis: SDD
operation: Freq
keyword: #p
keyword: freq=noraman
keyword: PBEPBE/SDD
title: #p freq=noraman PBEPBE/SDD
converged: YES YES NO NO
title: Mulliken charges:
elementType: S O O N C C C C C C C C C H H H H H H H H H H H
charge: 0.907653 -0.552327 -0.561657 -0.688806 -0.109512 -0.651453 -0.228706 -0.233503 -0.389625 -0.389568 0.510264 0.019789 -0.507405 0.266987 0.262602 0.281577 0.282007 0.229312 0.229392 0.245690 0.313520 0.313522 0.225923 0.224322
chargesum: 0.00000
title: Mulliken charges with hydrogens summed into heavy atoms:
elementType: S O O N C C C C C C C C C
charge: 0.907653 -0.552327 -0.561657 -0.061763 -0.109512 -0.121864 0.052871 0.048504 -0.160312 -0.160176 0.510264 0.265480 -0.057159
polarizability: 2.32883278e+02 7.40024121e+00 1.28914022e+02 -1.48638855e+00 -4.88153622e+00 8.35206765e+01
1716.lowfreq: -12.3956 -0.0030 -0.0019 -0.0010 1.8784 8.7914 27.2294 43.4363 50.5832
frequency: 27.1156 43.3680 50.5595 78.3969 130.8625 132.5992 181.1608 221.5152 228.5450 297.8206 309.5794 320.4227 398.7957 403.3487 408.5241 414.2992 418.4485 420.3044 478.1878 524.7027 602.4556 623.4730 676.5928 716.6697 789.8799 809.4199 819.6351 835.3687 850.4807 925.0392 952.2543 955.3232 959.4976 966.2856 983.0100 995.5841 1019.2048 1052.9179 1071.9143 1128.2045 1180.8623 1182.3221 1199.3100 1296.3071 1296.7535 1318.7973 1397.5245 1398.7808 1430.5182 1438.4562 1489.6408 1586.0256 1613.8147 1637.8105 1646.0890 3052.6020 3100.7509 3130.2870 3132.0325 3132.3176 3152.9727 3154.4386 3157.9961 3212.4475 3563.3704 3702.4291
redmass: 3.4152 3.9386 4.3304 3.1861 5.7078 4.9185 4.3519 8.2832 4.8465 5.6504 5.1216 3.7880 3.0567 1.0351 2.0929 2.7995 1.4025 3.2077 6.4572 3.0241 6.7984 6.9129 1.8216 2.9792 11.9957 5.0843 1.2554 1.8689 1.7476 2.9768 1.7155 1.5932 1.3527 1.3554 4.7448 1.1638 1.4314 2.5324 1.3272 1.1942 1.1185 1.2104 1.5615 1.2653 1.2628 2.6541 5.4003 1.1362 3.7390 1.2176 2.9601 7.3934 4.7008 4.1860 1.2314 1.0561 1.0603 1.0886 1.0889 1.0966 1.1086 1.0958 1.0968 1.1152 1.0452 1.1040
irintensity: 0.4080 1.5257 1.8763 1.4585 0.7309 0.8229 11.2020 9.2937 1.7554 7.7326 2.7635 0.6433 1.3168 0.6075 12.2325 1.7576 256.2000 94.6674 67.3843 58.2374 25.2090 0.5295 32.7026 1.9898 58.0777 26.8016 0.6554 72.5411 12.3901 57.0358 7.9104 17.1246 60.5860 0.0650 2.6191 11.6463 0.7271 54.6953 10.0472 13.9887 48.1141 1.8655 2.5370 1.2939 4.5110 81.7216 5.3776 13.9770 1.5856 10.9165 80.2667 7.3292 150.4896 2.0508 273.2242 10.6272 4.1503 13.0037 16.2322 2.3695 2.8706 3.7406 17.0591 18.8516 108.5643 24.9424
temp: 298.150 k
press: 1.00000 atm
elementType: 16 8 8 7 6 6 6 6 6 6 6 6 6 1 1 1 1 1 1 1 1 1 1 1
symmnumber: 1
zpe: 477468.0 jmol-1
zpe.correction: 0.181858 hartree
zpe.thermalcorrener: 0.195933 hartree
zpe.thermalcorrenthalpy: 0.196877 hartree
zpe.thermalcorrgfe: 0.139763 hartree
zpe.sumelectzpe: -951.671918 hartree
zpe.sumelectthermal: -951.657843 hartree
zpe.sumelectthermalent: -951.656899 hartree
zpe.sumelectthermalfe: -951.714013 hartree
dipole: 5.8028 -1.2965 -5.1801
dipole: 7.8859
quadrupole: -53.3452 -82.1300 -94.8022
quadrupole: 0.7800 4.9400 -2.3314
quadrupole: 23.4139 -5.3709 -18.0430 0.7800 4.9400 -2.3314
hfenergy: -951.8537755 hartree
pointgroup: C01 [X(C9H11N1O2S1)]
dipole: -2.270044 0.7983936 -1.9584028 debye
dipolederiv: 1.8723651 -0.0483011 0.0548444 0.0202169 1.0983774 -0.0935405 -0.1653466 -0.1294242 1.2745862 -0.6915397 -0.0099269 -0.0310925 -0.0219876 -0.5205149 -0.1686819 0.1090726 0.0008754 -0.6700553 -0.7159274 0.038459 -0.0069831 -0.022539 -0.7146576 0.1696408 0.1055 0.0280027 -0.5339733 -1.7789938 0.0892313 -0.1233935 0.1372937 -0.1607862 0.2062427 -0.2074251 0.2059864 -0.6950069 -0.5247976 0.0211159 -0.0485637 -0.0169929 -0.3419671 -0.0084646 0.0487257 0.0017869 -0.2907885 0.1049119 0.0910241 -0.0479062 0.1189567 -0.046204 -0.0246539 -0.1534165 0.0231327 -0.0299581 0.1461971 -0.1036669 0.0344312 -0.3563972 0.0789675 0.0105676 -0.0632067 0.0638832 -0.0543952 0.1710798 0.049475 0.0899682 0.3135976 0.0562716 0.0711504 0.1649214 0.0201551 -0.0448053 -0.5364824 0.0277108 -0.0300349 -0.3451602 0.051691 0.0254458 -0.190956 0.096036 -0.2098113 -0.5066858 0.0215506 -0.0255118 0.4331482 -0.0058637 0.1384185 0.0680297 0.0636623 -0.176034 1.8564385 -0.1370276 0.2489266 -0.1793805 0.0600839 -0.0626237 0.3101405 -0.0618601 0.1947064 0.0122854 -0.0257714 -0.0696878 -0.284286 0.052304 0.1180604 0.1310214 0.0047279 -0.2835156 -0.0811752 -0.1236835 0.1234384 -0.0175196 0.052524 0.0477589 0.0716695 0.0891177 -0.2745562 -0.0104543 -0.0580764 -0.0158438 -0.0687533 0.0385665 -0.0466341 -0.0391516 -0.0189151 -0.0199147 0.023604 0.0050389 0.0315251 0.076985 -0.0459466 0.0328379 0.0325465 0.0142472 0.0317463 0.1340174 -0.0662006 -0.0371834 -0.04804 0.0683908 -0.0240606 -0.0107086 -0.044773 0.1229418 0.1420758 0.0723608 0.0092058 0.0389907 0.0487926 -0.0280657 0.0191946 -0.0049701 0.1380654 -0.0439544 0.1017881 -0.000497 0.1011164 -0.0392848 -0.0556931 -0.0138588 -0.0509918 0.1532757 -0.0578096 -0.0852852 -0.0637101 -0.0708264 -0.011069 -0.0689847 -0.0740771 -0.0745344 0.1377919 0.0231469 0.0058816 0.0009666 0.0833894 -0.0452262 -0.04367 -0.0258566 -0.0189107 0.1618126 0.2410001 -0.0089156 -0.0358034 -0.0542224 0.1541687 -0.0838289 -0.0345715 -0.0818659 0.3525519 0.2469101 0.0218593 -0.0249969 0.0551958 0.1414498 -0.0697668 0.0018679 -0.0719039 0.3621965 -0.0960911 0.0340375 -0.0251036 0.0494669 0.0839572 -0.0102735 -0.0926033 -0.0262102 0.2044996 0.0698792 0.0873225 -0.0069948 0.0577477 -0.0540249 -0.031181 0.0084888 -0.027254 0.1486401 unknown
polarizability: 232.8463894|7.0153043|126.5821633|3.5030192|11.1871498|85.8894235 unknown
InChI: InChI=1S/C9H11NO2S/c1-2-7-13(11,12)9-5-3-8(10)4-6-9/h2-6H,1,7,10H2
charge 0 multiplicity 1
24 atoms
S  1.365944 -0.297033 0.602397
O  1.769289 0.833074 1.718444
O  1.661682 -1.894436 0.82338
N  -4.578137 0.304013 -0.492221
C  -0.464803 -0.10042 0.23363
C  2.293484 0.2284 -1.116976
C  -1.083908 1.130588 0.518722
C  -1.17652 -1.209682 -0.259206
C  -2.46191 1.264836 0.273669
C  -2.554523 -1.072491 -0.503354
C  -3.216176 0.168486 -0.247965
C  3.742383 -0.052321 -0.981157
C  4.664244 0.903612 -0.682036
H  1.759777 -0.398034 -1.847981
H  2.026723 1.293019 -1.197158
H  -0.501069 1.950075 0.952903
H  -0.664143 -2.165394 -0.414334
H  -2.964403 2.213945 0.493649
H  -3.128268 -1.926088 -0.88273
H  4.0534 -1.098133 -1.094419
H  -5.059826 1.176431 -0.29455
H  -5.125995 -0.476022 -0.84379
H  5.724268 0.653984 -0.565211
H  4.380687 1.952793 -0.538009
