program: Gaussian 09
title: 000239583
version: EM64L-G09RevD.01
frameworkgroup: C1[X(C11H12ClNO)]
method: RPBEPBE
basis: SDD
operation: Freq
keyword: #p
keyword: freq=noraman
keyword: PBEPBE/SDD
title: #p freq=noraman PBEPBE/SDD
converged: YES YES NO NO
title: Mulliken charges:
elementType: Cl O N C C C C C C C C C C C H H H H H H H H H H H H
charge: -0.069743 -0.288378 -0.124574 0.553746 -0.237953 0.198062 -0.314895 -0.321029 -0.372358 -0.626977 -0.613050 -0.229063 -0.241964 -0.225592 0.252583 0.237662 0.242002 0.231096 0.261691 0.227960 0.282196 0.223437 0.224010 0.257537 0.235182 0.238411
chargesum: 0.00000
title: Mulliken charges with hydrogens summed into heavy atoms:
elementType: Cl O N C C C C C C C C C C C
charge: -0.069743 -0.288378 -0.124574 0.553746 0.014631 0.198062 -0.077234 -0.321029 -0.130356 0.093769 0.116593 0.028475 -0.006782 0.012819
polarizability: 2.26743668e+02 -5.43185902e+00 1.53580591e+02 2.70159793e+00 -2.32681170e+00 6.90929022e+01
1716.lowfreq: -8.1245 -4.9213 0.0017 0.0020 0.0024 4.4319 23.4131 55.1300 59.1546
frequency: 23.2983 55.1266 59.1485 98.0380 122.1268 129.8015 152.7387 169.0926 204.5239 234.1041 253.3564 284.8869 326.2247 377.9162 387.1017 405.5301 445.7959 504.9404 532.2007 560.2709 628.1644 654.1269 685.0396 724.9858 753.5115 761.9898 843.3550 861.3837 880.0501 950.1385 982.8725 986.3460 993.0626 1014.0168 1041.0149 1051.0650 1094.4944 1118.1844 1141.7279 1170.7231 1179.4711 1222.0988 1239.5258 1268.4922 1281.0322 1312.0109 1371.4912 1387.0875 1411.0557 1426.9721 1437.9632 1459.9337 1469.6065 1472.6496 1488.2625 1498.7611 1554.2042 1565.5564 1601.8514 1636.5840 2962.2091 2969.2276 3034.5933 3043.3904 3119.6864 3121.2622 3126.2811 3135.9910 3138.3751 3150.2257 3164.2208 3177.9932
redmass: 4.8480 5.0744 3.6367 2.9255 1.7100 1.7764 1.9300 3.2023 2.6859 3.7845 2.4127 4.1884 3.6743 8.6330 3.3603 3.5928 3.1843 3.9349 4.3085 6.7377 5.0675 5.8890 6.4752 3.4016 4.3568 1.3227 4.2801 1.4813 2.1342 1.3860 1.8662 1.5312 1.1973 6.4412 2.0368 1.3782 1.2277 1.8367 1.3897 1.2239 1.8406 1.8556 4.7764 1.4304 1.7985 1.3007 4.8123 2.9810 1.1847 2.3283 1.2465 2.3343 1.0861 1.0463 1.0521 1.3118 4.5179 5.7515 6.9052 6.1439 1.0380 1.0368 1.0998 1.1013 1.0973 1.0956 1.0941 1.0857 1.0854 1.0902 1.0955 1.0997
irintensity: 5.8534 4.2766 0.5561 0.7638 3.3784 1.0594 1.9069 2.1929 0.3730 0.5311 2.8269 8.3059 4.6177 6.3583 10.1283 2.0693 9.7180 11.2227 4.9980 14.2029 5.0777 10.1632 12.0913 5.8145 10.5354 91.0754 0.9063 4.7168 7.1981 0.3267 20.9792 47.5278 44.4145 56.0045 1.8031 7.6193 0.6304 4.8605 0.3407 33.9201 94.4070 6.9791 43.9834 6.3231 2.6506 2.1505 12.8221 105.2937 50.6825 34.1132 13.1494 53.8444 19.0936 7.4521 23.1678 28.9589 261.4788 1.5397 5.4716 11.1126 31.9008 106.4383 48.4912 28.3344 1.4194 14.5220 1.4363 14.3356 1.2483 5.2934 14.2647 14.0094
temp: 298.150 k
press: 1.00000 atm
elementType: 17 8 7 6 6 6 6 6 6 6 6 6 6 6 1 1 1 1 1 1 1 1 1 1 1 1
symmnumber: 1
zpe: 532879.8 jmol-1
zpe.correction: 0.202963 hartree
zpe.thermalcorrener: 0.217266 hartree
zpe.thermalcorrenthalpy: 0.218211 hartree
zpe.thermalcorrgfe: 0.160147 hartree
zpe.sumelectzpe: -1015.368762 hartree
zpe.sumelectthermal: -1015.354459 hartree
zpe.sumelectthermalent: -1015.353515 hartree
zpe.sumelectthermalfe: -1015.411579 hartree
dipole: 1.7390 1.9801 1.6701
dipole: 3.1199
quadrupole: -77.6023 -91.5091 -93.0347
quadrupole: -18.0116 -3.3051 -2.9679
quadrupole: 9.7797 -4.1271 -5.6527 -18.0116 -3.3051 -2.9679
hfenergy: -1015.5717256 hartree
pointgroup: C01 [X(C11H12Cl1N1O1)]
dipole: -0.5896612 0.8713895 -0.6322106 debye
dipolederiv: -0.2055473 -0.2555606 -0.0331727 -0.1543477 -0.6667804 -0.0803748 -0.0132571 -0.0789232 -0.0840409 -0.9835144 0.318102 -0.0585546 -0.080987 -1.0257399 0.21049 0.098014 0.2371788 -0.4499762 -0.8855753 -0.2927033 0.1019947 -0.4199683 -0.8190179 0.1617709 0.0242313 0.1150725 -0.359774 0.1625524 -0.1323727 -0.020351 -0.0844473 -0.2479068 -0.0526842 -0.0232552 -0.0544062 0.0569792 0.1817652 -0.0423266 -0.0289888 0.0664377 0.00374 0.0830944 0.2091743 0.0304873 -0.0860356 1.6157755 0.0458795 -0.0711255 0.8139997 1.2831097 -0.3955865 -0.235855 -0.3122604 0.2721238 -0.4334105 0.0943588 0.0394533 -0.049876 0.0816614 0.1355916 0.1167886 0.0923237 -0.1432159 0.1554125 0.4312391 0.0651233 0.1964807 0.9458365 0.1377765 -0.0155948 0.1382308 -0.0698118 -0.0872211 0.0279727 0.0285997 -0.0390426 0.0339074 0.0015303 0.0418384 0.0071935 -0.1361343 -0.0205261 -0.1097533 -0.0354033 0.0464048 0.4174942 -0.0782077 -0.1169371 -0.067731 0.2620657 0.5009053 0.0883086 -0.0179968 -0.1139086 0.0188183 0.1172012 0.0435456 0.1210424 0.2099353 -0.1144885 -0.1666762 -0.0161943 -0.1887536 -0.159038 -0.012924 -0.0152186 -0.0130337 -0.0996576 -0.0581406 0.0877636 0.0161221 0.1423598 0.0610311 0.0234933 0.0095698 0.024242 -0.1451471 0.0033959 -0.0116694 0.0155627 0.0090021 0.0429592 0.0247676 0.0094262 0.018071 -0.1546357 0.0398299 -0.0275116 -0.0267633 -0.0947854 0.0121492 -0.0637959 -0.0784084 -0.0430945 0.1195279 0.0353129 -0.0577173 -0.045819 -0.0483971 -0.0051035 -0.0689806 -0.1344339 -0.0367011 0.1321241 0.0502301 0.0869281 -0.005353 0.0641016 -0.0252396 -0.0101291 -0.011138 -0.0130172 0.1435855 0.1140327 0.0570406 0.0097325 -0.0006184 -0.1255161 -0.0321567 0.0206109 -0.1211619 -0.0307804 -0.0011258 0.0310553 -0.121384 0.0195895 0.0564428 -0.0409184 -0.1145963 -0.0133176 0.0717729 -0.0739246 -0.076054 0.1659971 -0.0400258 0.0202781 0.0479741 0.1352414 0.0909855 -0.0123152 0.1761488 -0.0120938 -0.0009385 0.1363354 0.0346005 0.0866 -0.0222874 0.0426334 0.0889406 -0.0287243 -0.0212664 -0.0004622 -0.1148136 -0.0497177 -0.1523023 -0.0668652 -0.1231804 0.0199581 -0.1138142 -0.033169 0.0679973 -0.0354052 0.1029356 0.0114767 0.1693471 0.0069271 -0.0917799 0.0534509 0.0528311 0.0016918 0.0808079 -0.0104942 -0.0168097 0.0074629 -0.0142734 0.1641909 0.0280251 -0.0719801 -0.0145246 -0.1020985 -0.0598269 -0.0274796 -0.0199705 -0.0216009 0.1601046 -0.1108244 -0.010625 -0.0152427 -0.008044 0.0794173 -0.009417 -0.0174331 -0.0116866 0.161996 unknown
polarizability: 227.0122692|-3.5423364|153.2037007|1.7227558|4.0107467|69.2011905 unknown
InChI: InChI=1S/C11H12ClNO/c1-13(2)11(14)8-7-9-5-3-4-6-10(9)12/h3-8H,1-2H3
charge 0 multiplicity 1
26 atoms
Cl -1.253453 2.754839 0.218602
O  3.051623 -2.111115 0.326728
N  3.346961 0.113075 -0.325684
C  -1.242358 -0.057669 -0.093423
C  0.22706 0.000987 0.004612
C  2.561136 -1.018204 -0.120916
C  1.089632 -0.978535 -0.399274
C  -2.045639 1.112621 0.002285
C  -1.944698 -1.288563 -0.268066
C  2.923502 1.329443 -1.038482
C  4.759181 0.074127 0.094077
C  -3.449602 1.091085 -0.080518
C  -3.348118 -1.336373 -0.356851
C  -4.107381 -0.145421 -0.263722
H  0.633934 0.91741 0.449113
H  0.719248 -1.91635 -0.831168
H  -1.369222 -2.219386 -0.305459
H  2.775071 2.18244 -0.346866
H  1.986786 1.153581 -1.586319
H  3.706157 1.6139 -1.767416
H  4.937223 -0.870409 0.629626
H  4.984618 0.928937 0.759661
H  5.431816 0.122654 -0.784473
H  -4.016362 2.023249 -0.004306
H  -3.852735 -2.299573 -0.485191
H  -5.200079 -0.173848 -0.32557
