program: Gaussian 09
title: 000239582
version: EM64L-G09RevD.01
frameworkgroup: C1[X(C13H17NO)]
method: RPBEPBE
basis: SDD
operation: Freq
keyword: #p
keyword: freq=noraman
keyword: PBEPBE/SDD
title: #p freq=noraman PBEPBE/SDD
converged: YES YES NO NO
title: Mulliken charges:
elementType: O N C C C C C C C C C C C C C H H H H H H H H H H H H H H H H H
charge: -0.287422 -0.388892 -0.332174 -0.352300 -0.395967 -0.685473 0.240456 -0.380193 0.471973 -0.238639 -0.372463 -0.386602 -0.235247 -0.234401 -0.236620 0.222877 0.193865 0.189320 0.195574 0.205383 0.257727 0.215296 0.214854 0.209718 0.291632 0.203366 0.265760 0.222788 0.237434 0.226933 0.230012 0.231427
chargesum: 0.00000
title: Mulliken charges with hydrogens summed into heavy atoms:
elementType: O N C C C C C C C C C C C C C
charge: -0.287422 -0.097260 0.084569 0.032594 0.067143 -0.045605 0.240456 -0.176827 0.471973 0.027120 -0.149676 -0.149167 -0.008314 -0.004390 -0.005193
polarizability: 2.71525673e+02 1.36549835e+01 1.34215389e+02 2.04169644e+01 -2.15489885e+01 1.00513946e+02
1716.lowfreq: -3.1673 -0.0005 -0.0003 0.0003 2.8103 7.6592 12.8794 31.5664 36.1484
frequency: 12.6817 31.2824 36.1425 60.6723 83.7971 94.6292 109.5578 162.7576 206.7906 224.2649 233.8487 263.0010 279.2355 296.1352 372.0905 402.8328 476.6127 493.6240 513.8496 535.1359 567.1370 616.1319 678.5873 690.6808 700.6076 738.4387 774.1859 805.9174 840.2373 845.9571 853.7009 873.8911 915.7831 923.7523 968.7106 977.3920 983.3359 989.2125 994.8513 1012.1430 1025.9972 1046.8868 1083.0173 1093.2461 1118.0004 1134.1547 1173.4034 1189.2094 1192.9040 1216.1782 1227.5424 1261.6429 1287.2782 1293.5826 1309.1413 1321.8498 1334.0390 1348.1540 1366.5691 1385.8902 1390.4095 1440.3198 1447.2761 1458.0895 1473.0482 1476.5408 1481.4422 1485.7129 1488.7337 1582.7965 1585.2287 1611.4712 1656.0282 2959.1114 2974.2938 2977.7261 2989.1843 3005.4932 3045.7686 3071.2108 3073.2575 3074.6505 3096.2560 3104.2653 3123.4778 3127.0133 3139.7025 3150.4322 3166.3620 3555.6622
redmass: 3.6902 4.6767 4.4445 1.8934 2.7292 4.5805 3.2471 2.8281 4.0304 1.1465 4.1086 3.0091 3.3437 3.1705 2.8766 2.7547 2.0838 3.5428 1.8076 1.9057 5.8283 6.4198 3.7107 3.5218 1.7273 1.2126 2.0317 2.2501 2.5638 1.2956 1.9120 1.8515 1.8369 1.4489 1.9016 1.3887 2.2093 5.4490 1.3114 1.2255 2.2217 3.1383 1.5973 3.0288 2.0484 1.8797 1.0661 1.2421 1.5909 1.6575 1.3365 1.3129 1.1073 1.9840 1.2649 1.5113 1.2675 1.4995 1.3687 6.8451 1.2126 2.2922 1.1436 1.0849 1.0872 1.0447 1.7461 1.1466 1.9844 5.7017 6.6985 5.9737 5.6656 1.0589 1.0373 1.0603 1.0652 1.0980 1.1007 1.1001 1.0997 1.1000 1.0926 1.0874 1.0855 1.0872 1.0916 1.0964 1.1016 1.0775
irintensity: 1.0996 1.7230 4.6530 0.2627 0.7984 2.6024 0.5015 0.6445 0.7567 0.0479 3.8929 1.2667 3.5875 5.9353 14.0685 0.0484 37.4076 15.4551 20.9084 60.5341 15.8429 0.1333 3.6342 2.2886 47.9155 15.3070 68.7587 2.8896 1.7633 1.1108 0.9614 18.4004 2.2538 0.0014 5.8783 0.3342 17.1331 0.0986 5.6667 41.1753 3.8653 3.7126 11.7007 5.0062 3.5075 1.5442 0.0345 18.4054 122.5568 28.6031 11.5763 43.6062 1.4663 21.7031 10.0378 72.7311 6.8708 1.2733 2.5517 10.1440 9.3032 13.9297 44.5250 6.1920 22.9767 7.1060 86.7189 17.9767 196.7005 9.8910 160.3111 1.5166 84.2930 29.4047 27.4666 59.8216 54.9630 8.6285 50.0598 71.7324 13.8846 55.8307 1.8289 16.2563 5.7173 0.9985 8.2623 42.1148 28.4330 19.0674
temp: 298.150 k
press: 1.00000 atm
elementType: 8 7 6 6 6 6 6 6 6 6 6 6 6 6 6 1 1 1 1 1 1 1 1 1 1 1 1 1 1 1 1 1
symmnumber: 1
zpe: 707347.4 jmol-1
zpe.correction: 0.269414 hartree
zpe.thermalcorrener: 0.284950 hartree
zpe.thermalcorrenthalpy: 0.285894 hartree
zpe.thermalcorrgfe: 0.223364 hartree
zpe.sumelectzpe: -634.444017 hartree
zpe.sumelectthermal: -634.428481 hartree
zpe.sumelectthermalent: -634.427537 hartree
zpe.sumelectthermalfe: -634.490067 hartree
dipole: 0.1474 3.4431 -1.6256
dipole: 3.8104
quadrupole: -71.6182 -93.8164 -90.7913
quadrupole: -2.1215 5.9264 -4.0869
quadrupole: 13.7904 -8.4078 -5.3827 -2.1215 5.9264 -4.0869
hfenergy: -634.7134311 hartree
pointgroup: C01 [X(C13H17N1O1)]
dipole: 0.0806413 1.3461657 -0.6547985 debye
polarizability: 272.321326|10.8805629|133.2354565|18.5381021|-22.4001698|100.6982257 unknown
InChI: InChI=1S/C13H17NO/c1-2-3-11-14-13(15)10-9-12-7-5-4-6-8-12/h4-10,14H,2-3,11H2,1H3
charge 0 multiplicity 1
32 atoms
O  -1.392075 -2.022255 0.307461
N  -2.343286 -0.286299 -0.926446
C  -4.587264 -0.192345 0.233833
C  -4.84951 1.316332 0.025657
C  -3.707182 -0.836469 -0.865213
C  -5.767169 1.915603 1.113403
C  -1.262209 -0.91932 -0.317537
C  0.03964 -0.205524 -0.467582
C  2.535704 -0.15865 0.03981
C  1.177656 -0.720581 0.085277
C  2.859034 1.057401 -0.631272
C  3.585008 -0.861194 0.699534
C  4.178924 1.547841 -0.638372
C  4.90763 -0.370823 0.693062
C  5.210804 0.837094 0.023686
H  -4.106419 -0.359379 1.217045
H  -5.556028 -0.732559 0.255671
H  -5.306333 1.475498 -0.973627
H  -3.88341 1.861283 0.024971
H  -4.186576 -0.708649 -1.855868
H  -3.598161 -1.916868 -0.666749
H  -5.32158 1.790093 2.117927
H  -5.93779 2.995669 0.950812
H  -6.753266 1.414119 1.119765
H  -2.192459 0.607373 -1.39627
H  0.048996 0.737226 -1.032088
H  1.050863 -1.669178 0.628423
H  2.074841 1.620616 -1.149628
H  3.35167 -1.798242 1.219679
H  4.409782 2.483981 -1.159139
H  5.698922 -0.927267 1.207245
H  6.236642 1.22167 0.015732
