program: Gaussian 09
title: 000239573
version: EM64L-G09RevD.01
frameworkgroup: C1[X(C16H16O3)]
method: RPBEPBE
basis: SDD
operation: Freq
keyword: #pfreq=noraman
keyword: PBEPBE/SDD
title: #p freq=noraman PBEPBE/SDD
converged: YES YES NO NO
title: Mulliken charges:
elementType: O O O C C C C C C C C C C C C C C C C H H H H H H H H H H H H H H H H
charge: -0.286846 -0.248731 -0.266265 -0.226683 -0.138209 -0.366503 0.521403 0.348903 -0.458708 -0.371721 -0.356496 -0.379414 -0.352145 -0.345997 -0.219057 -0.235098 0.323849 -0.239628 -0.538254 0.226901 0.246805 0.230217 0.240705 0.231796 0.262182 0.271492 0.259140 0.252954 0.240574 0.227299 0.228237 0.229311 0.220588 0.245522 0.221876
chargesum: 0.00000
title: Mulliken charges with hydrogens summed into heavy atoms:
elementType: O O O C C C C C C C C C C C C C C C C
charge: -0.286846 -0.248731 -0.266265 0.000218 0.108596 0.104419 0.521403 0.348903 -0.226912 -0.109539 -0.085004 -0.120274 -0.099192 -0.105423 0.008242 -0.006861 0.323849 -0.010317 0.149732
polarizability: 2.33968891e+02 -1.13114677e+01 1.80095489e+02 1.14113229e+01 6.58850596e+00 1.15949843e+02
1716.lowfreq: -6.5391 -1.4144 -0.0007 0.0003 0.0005 12.0888 17.6855 29.9793 46.3771
frequency: 17.2484 29.9518 46.3612 66.2049 96.3866 113.7177 139.7287 153.8757 219.1032 223.6361 245.6185 284.3506 292.9996 307.5138 343.7154 404.8428 414.2380 428.0903 477.9803 507.2279 524.1074 559.6724 571.0373 614.7842 627.0425 634.6364 691.3702 703.2534 705.3339 760.9611 767.1610 794.6267 809.3139 829.4601 854.4295 861.1587 865.8121 890.2356 908.7214 921.6548 955.2049 970.5532 976.9860 980.8921 988.2175 989.9835 997.2900 1005.9127 1026.4080 1030.3820 1058.6246 1094.9867 1111.0689 1113.2965 1156.5817 1172.6419 1175.4035 1180.7096 1187.3538 1210.8409 1218.1535 1230.2141 1234.3117 1274.8675 1285.7238 1296.2394 1301.6963 1319.8310 1352.2539 1376.7836 1390.0029 1415.6652 1437.0182 1443.1117 1459.7842 1467.7005 1473.6469 1485.1941 1499.5768 1583.4969 1595.1490 1615.2565 1622.0271 2959.0682 2989.8886 3001.6369 3026.3054 3046.4429 3116.4057 3117.3020 3124.7715 3127.0748 3139.0309 3141.9939 3148.1896 3150.2355 3164.5789 3164.8012 3170.2941
redmass: 4.9492 3.9812 3.9043 3.9239 4.3107 3.8738 4.7461 4.9321 2.9614 1.9914 1.9690 4.0954 3.8861 4.6901 6.3479 2.8275 3.1532 5.0315 4.4459 3.1970 3.2946 4.2661 3.2544 6.4166 6.8010 5.8378 6.4239 2.9192 2.0146 3.2421 2.3433 4.0496 2.0403 1.4717 1.2759 3.0139 3.4935 4.2430 4.2978 1.5187 1.4393 2.9472 1.3833 1.3856 8.4659 6.0221 1.3356 2.7586 2.1701 4.2358 2.3209 1.7334 1.3267 1.2669 1.3289 1.0563 1.2491 1.2012 1.1126 2.3078 1.8995 4.0191 1.2680 1.2556 1.3576 1.3507 1.2927 1.2672 1.4871 5.5861 5.4923 3.8049 1.1719 2.1229 1.0927 1.0501 1.0806 2.3525 2.4324 7.4355 6.0403 6.0931 6.3322 1.0330 1.0720 1.0793 1.0872 1.1039 1.0957 1.0921 1.0993 1.0865 1.0914 1.0878 1.0882 1.0958 1.1014 1.0952 1.0970
irintensity: 0.6091 0.2257 0.6810 1.9683 1.0691 1.3647 3.9708 4.8021 5.4187 5.7818 0.8999 2.1109 0.1520 5.6197 0.6045 0.6305 0.0227 0.5344 2.9117 19.1189 11.2791 28.4866 2.8244 0.2488 0.6563 13.2266 8.5957 4.9949 44.4868 36.3869 28.1477 9.6383 56.1542 6.7271 0.2920 28.6490 71.3190 78.4582 8.8384 2.5897 19.8205 15.7204 2.8388 4.2668 47.4317 1.3585 1.0711 29.3549 2.7480 166.6718 3.5269 1.7766 6.9187 0.9925 2.1362 0.3256 98.4432 3.4038 0.0845 6.8582 11.3042 215.0559 2.8523 0.2677 15.4094 44.8527 8.1058 2.1106 1.5473 8.4573 0.4096 3.3635 8.3545 12.6156 6.3119 13.1644 54.1882 12.2213 77.3881 9.8199 0.0696 2.1246 77.9344 68.6416 22.7303 51.6745 35.4403 49.3551 7.8014 21.7597 25.6045 0.7181 16.1197 3.5015 7.3815 23.7203 21.1430 17.7640 3.8020
temp: 298.150 k
press: 1.00000 atm
elementType: 8 8 8 6 6 6 6 6 6 6 6 6 6 6 6 6 6 6 6 1 1 1 1 1 1 1 1 1 1 1 1 1 1 1 1
symmnumber: 1
zpe: 736042.1 jmol-1
zpe.correction: 0.280344 hartree
zpe.thermalcorrener: 0.296766 hartree
zpe.thermalcorrenthalpy: 0.297710 hartree
zpe.thermalcorrgfe: 0.234247 hartree
zpe.sumelectzpe: -843.563503 hartree
zpe.sumelectthermal: -843.547081 hartree
zpe.sumelectthermalent: -843.546137 hartree
zpe.sumelectthermalfe: -843.609600 hartree
dipole: -0.6205 0.7818 -2.4685
dipole: 2.6627
quadrupole: -87.7022 -110.1649 -112.8007
quadrupole: -0.8760 5.1856 -0.4106
quadrupole: 15.8537 -6.6090 -9.2448 -0.8760 5.1856 -0.4106
hfenergy: -843.8438465 hartree
pointgroup: C01 [X(C16H16O3)]
dipole: 0.0478784 0.6703626 0.8035847 debye
polarizability: 224.5595285|25.9123863|171.294645|23.5937838|-22.353436|134.1600492 unknown
InChI: InChI=1S/C16H16O3/c1-17-14-9-7-13(8-10-14)16-18-11-15(19-16)12-5-3-2-4-6-12/h2-10,15-16H,11H2,1H3
charge 0 multiplicity 1
35 atoms
O  -0.801069 -1.823775 -0.673777
O  -0.254175 -2.282341 1.581017
O  4.326386 2.023524 -0.088995
C  -2.005831 -1.529406 0.167695
C  0.330651 -2.114189 0.241946
C  -1.399981 -1.349786 1.585492
C  -2.761029 -0.325645 -0.35746
C  1.368254 -0.997232 0.192297
C  -4.163642 -0.399624 -0.538528
C  -2.091758 0.893401 -0.638459
C  1.582742 -0.26146 -1.002554
C  2.172249 -0.719842 1.320776
C  2.573749 0.734316 -1.063146
C  3.168434 0.282316 1.277131
C  -4.893109 0.727982 -0.980007
C  -2.817604 2.017566 -1.085792
C  3.36967 1.010219 0.078024
C  -4.221267 1.940704 -1.253765
C  5.178208 2.345692 1.058098
H  -2.653237 -2.427324 0.1458
H  0.751918 -3.098211 -0.032009
H  -1.058242 -0.307698 1.740457
H  -2.073145 -1.661505 2.397074
H  -4.686475 -1.343295 -0.337863
H  -1.00282 0.94807 -0.529823
H  0.957113 -0.470091 -1.876502
H  2.005258 -1.284811 2.244263
H  2.749019 1.310941 -1.97649
H  3.770275 0.481818 2.168787
H  -5.978034 0.657897 -1.116588
H  -2.290971 2.952874 -1.306537
H  -4.782976 2.814897 -1.601743
H  4.578934 2.706348 1.916954
H  5.841909 3.149043 0.706256
H  5.783096 1.471731 1.369473
