program: Gaussian 09
title: 000239571
version: EM64L-G09RevD.01
frameworkgroup: C1[X(C13H18O2)]
method: RPBEPBE
basis: SDD
operation: Freq
keyword: #pfreq=noraman
keyword: PBEPBE/SDD
title: #p freq=noraman PBEPBE/SDD
converged: YES YES NO NO
title: Mulliken charges:
elementType: O O C C C C C C C C C C C C C H H H H H H H H H H H H H H H H H H
charge: -0.313074 -0.271691 0.358694 -0.204736 -0.378517 -0.361805 -0.737255 -0.367390 0.485163 -0.694834 -0.447987 -0.377960 -0.222662 -0.223413 -0.240047 0.222514 0.209554 0.198132 0.212562 0.234805 0.228816 0.221497 0.233687 0.232199 0.199842 0.208980 0.210540 0.218615 0.231725 0.252511 0.226868 0.225613 0.229054
chargesum: 0.00000
title: Mulliken charges with hydrogens summed into heavy atoms:
elementType: O O C C C C C C C C C C C C C
charge: -0.313074 -0.271691 0.358694 0.017777 0.029168 0.085562 -0.053255 0.064651 0.485163 -0.056699 -0.216262 -0.125449 0.004207 0.002200 -0.010993
polarizability: 1.84481413e+02 -3.68813823e+00 1.46244107e+02 5.59408456e-01 6.26604820e+00 9.60112337e+01
1716.lowfreq: -3.8659 -0.7587 -0.0008 -0.0005 -0.0003 12.7386 24.0083 24.8037 76.8005
frequency: 21.1516 24.0150 76.7403 87.2933 95.3280 119.5796 161.3321 194.6073 225.8080 231.6526 268.8418 284.9854 307.8991 339.5509 368.1703 403.4486 425.5661 489.0598 521.0222 567.8237 613.3357 631.2668 640.6560 703.3696 739.8783 744.4676 764.6576 791.9641 823.1872 854.0327 861.3645 889.9231 907.6484 921.3078 939.7728 976.4471 978.8083 983.6086 990.3120 996.1156 1025.6271 1028.5094 1046.9429 1057.6181 1083.4905 1089.2389 1126.9697 1167.5695 1172.0258 1183.5774 1188.9782 1213.4407 1220.7240 1260.3269 1270.8739 1285.4806 1290.7075 1306.6569 1317.9135 1349.5936 1352.5442 1385.4826 1388.6005 1390.7651 1441.3102 1448.2980 1463.1365 1465.8687 1469.8496 1476.5562 1477.4117 1484.2455 1487.6698 1595.0967 1615.5037 2967.9606 2971.2355 2978.5623 2981.9135 2989.4689 3001.4890 3026.9222 3048.0406 3072.8541 3073.1095 3098.3886 3102.0190 3111.5736 3115.7113 3126.9157 3139.9933 3152.7584 3165.4408
redmass: 4.0945 3.7549 2.3571 2.5382 2.3560 3.3764 3.1508 1.2868 2.3011 1.2116 2.7295 3.9340 3.0140 3.3564 3.8144 2.8293 3.4259 3.3153 3.2293 2.8626 6.0529 5.1116 5.2506 1.8417 2.6310 1.3577 2.0148 3.1298 3.9243 1.2521 1.3269 1.9166 2.6799 1.5942 2.1393 1.7510 2.5475 2.3521 5.2312 1.3633 2.1197 1.8155 2.3339 2.1980 2.1707 1.6564 2.2488 1.3718 1.0572 1.1201 1.7939 1.9777 1.8827 1.7214 1.3062 1.3300 1.4417 1.2817 1.2811 1.5431 1.5566 1.2708 5.9488 1.2153 2.1514 1.0732 1.0584 1.0609 1.0879 1.0450 1.0452 2.3854 1.0846 6.1434 6.1544 1.0803 1.0363 1.0625 1.0677 1.0603 1.0360 1.0985 1.1019 1.0992 1.1019 1.0995 1.0995 1.1002 1.0874 1.0864 1.0917 1.0954 1.1012
irintensity: 0.6538 0.1949 0.1344 0.8030 1.1338 4.2717 0.5605 0.2062 2.1628 0.3320 0.2285 0.3838 0.7873 1.6608 3.4038 0.4025 5.2562 12.0070 14.6272 10.4098 0.6821 2.9921 7.1393 44.5780 14.4792 14.1629 55.6402 34.8348 7.5545 0.3489 1.8931 7.7763 41.7468 4.8247 6.6641 11.6776 26.8404 49.6522 0.2982 0.6761 9.5106 102.0781 7.2087 3.9449 4.5469 4.5898 26.4465 42.1345 0.0921 4.0720 49.4499 15.0711 29.4334 21.4570 1.4223 18.4872 11.0982 15.4565 1.9182 0.3289 4.0112 33.7190 0.6658 17.0565 10.9623 5.9951 3.3389 11.3345 7.5837 6.5738 7.6809 14.9848 14.4612 0.5448 3.9754 24.8066 35.1060 5.0247 57.6197 45.9214 12.6446 6.0850 7.8378 52.5558 92.3118 20.0891 22.2601 24.3351 8.9822 0.1620 20.7783 34.6428 18.7404
temp: 298.150 k
press: 1.00000 atm
elementType: 8 8 6 6 6 6 6 6 6 6 6 6 6 6 6 1 1 1 1 1 1 1 1 1 1 1 1 1 1 1 1 1 1
symmnumber: 1
zpe: 734022.4 jmol-1
zpe.correction: 0.279574 hartree
zpe.thermalcorrener: 0.294622 hartree
zpe.thermalcorrenthalpy: 0.295566 hartree
zpe.thermalcorrgfe: 0.235887 hartree
zpe.sumelectzpe: -655.471734 hartree
zpe.sumelectthermal: -655.456686 hartree
zpe.sumelectthermalent: -655.455742 hartree
zpe.sumelectthermalfe: -655.515422 hartree
dipole: -0.8515 0.2258 0.3525
dipole: 0.9489
quadrupole: -81.7814 -86.5328 -95.2230
quadrupole: 3.0565 -2.1495 3.5769
quadrupole: 6.0643 1.3130 -7.3773 3.0565 -2.1495 3.5769
hfenergy: -655.7513087 hartree
pointgroup: C01 [X(C13H18O2)]
dipole: 0.3388786 0.0840464 -0.1321279 debye
polarizability: 184.4056774|3.843853|145.8101639|2.8298681|-7.6594349|96.5209125 unknown
InChI: InChI=1S/C13H18O2/c1-3-9-13(2)14-10-12(15-13)11-7-5-4-6-8-11/h4-8,12H,3,9-10H2,1-2H3
charge 0 multiplicity 1
33 atoms
O  -0.812477 -0.389556 0.73935
O  -1.607967 -1.818898 -0.988812
C  -2.060844 -0.865051 0.065973
C  0.33508 -1.156223 0.188531
C  -2.745701 0.348286 -0.589766
C  -0.183583 -1.533454 -1.222636
C  -2.924406 -1.654419 1.049595
C  -3.14595 1.468743 0.397212
C  1.589975 -0.308264 0.200517
C  -3.693958 2.713482 -0.333372
C  2.840784 -0.903729 0.495096
C  1.54068 1.070612 -0.124909
C  4.029094 -0.139786 0.448653
C  2.725546 1.83687 -0.163335
C  3.974606 1.233462 0.117852
H  0.484479 -2.076842 0.789329
H  -3.639614 -0.016228 -1.132831
H  -2.051329 0.758189 -1.349748
H  -0.047141 -0.686611 -1.925063
H  0.272406 -2.446495 -1.635603
H  -3.235969 -1.014018 1.89125
H  -3.824533 -2.041573 0.54075
H  -2.350409 -2.506977 1.447888
H  -2.26265 1.743827 1.004157
H  -3.913129 1.092875 1.102464
H  -2.93214 3.144606 -1.010387
H  -4.580173 2.460244 -0.945821
H  -3.992174 3.500497 0.383232
H  2.886127 -1.966344 0.765661
H  0.56778 1.536972 -0.313558
H  4.990937 -0.611736 0.678354
H  2.677386 2.904168 -0.407548
H  4.893668 1.829472 0.088326
