program: Gaussian 09
title: 000239570
version: EM64L-G09RevD.01
frameworkgroup: C1[X(C15H22O2)]
method: RPBEPBE
basis: SDD
operation: Freq
keyword: #pfreq=noraman
keyword: PBEPBE/SDD
title: #p freq=noraman PBEPBE/SDD
converged: YES YES NO NO
title: Mulliken charges:
elementType: O O C C C C C C C C C C C C C C C H H H H H H H H H H H H H H H H H H H H H H
charge: -0.290247 -0.269491 0.011053 -0.409197 -0.197799 -0.372327 -0.318924 -0.365924 -0.354444 0.474056 -0.355621 -0.444927 -0.378755 -0.695994 -0.225111 -0.224330 -0.239653 0.195154 0.217381 0.212875 0.224225 0.225166 0.185405 0.217005 0.222456 0.193936 0.187888 0.187887 0.191308 0.194761 0.195231 0.231240 0.257024 0.214995 0.209675 0.210281 0.227524 0.226625 0.229593
chargesum: 0.00000
title: Mulliken charges with hydrogens summed into heavy atoms:
elementType: O O C C C C C C C C C C C C C C C
charge: -0.290247 -0.269491 0.206207 0.021059 0.026426 0.038244 0.120537 0.015899 0.024752 0.474056 0.034371 -0.213686 -0.121732 -0.061043 0.002413 0.002295 -0.010061
polarizability: 2.07355727e+02 1.68250537e+01 1.55551320e+02 1.07039074e+01 -1.34348093e+01 1.31899221e+02
1716.lowfreq: -21.3359 -12.3637 -8.0688 -2.8967 -0.0005 -0.0005 0.0004 16.6831 28.7863
frequency: -10.1316 16.5752 28.7137 43.4225 53.7922 73.6292 89.1897 105.7890 116.4894 136.0550 168.6567 214.8743 220.7042 227.6152 269.6942 304.5359 332.3362 402.7198 422.7426 440.3412 507.2184 524.3995 576.8590 613.4094 634.6046 662.0877 703.1878 723.3541 737.2085 761.6899 780.9472 814.8052 838.8401 855.7041 858.5580 889.2147 899.7874 915.0046 924.2621 960.3021 979.3676 980.9816 990.5073 991.4858 997.7975 1013.7622 1025.3760 1031.0220 1044.1871 1067.5244 1079.6117 1085.9273 1100.5892 1120.6710 1149.1225 1162.4726 1172.5932 1185.0658 1195.8051 1215.1698 1225.8440 1241.6874 1255.0264 1270.9066 1278.2963 1284.3466 1290.9508 1293.0900 1297.8926 1319.4366 1325.0411 1346.9594 1353.6456 1358.1195 1380.2723 1388.6886 1391.6317 1441.8685 1451.4369 1463.9839 1466.3728 1474.5758 1475.8727 1479.9822 1483.0936 1485.0565 1488.8655 1595.0699 1616.2632 2932.0830 2950.7299 2954.6694 2957.6118 2964.5696 2968.4334 2971.0050 2987.4675 2995.7259 3000.0140 3003.6721 3024.0080 3037.4405 3064.3898 3067.2383 3069.6718 3071.8893 3117.5024 3127.9423 3141.1070 3154.3432 3166.3633
redmass: 3.8861 4.0384 1.5592 3.1762 3.5060 3.9670 2.7599 3.7790 1.8521 2.4200 3.0915 3.4968 1.1949 4.4477 3.8632 4.5760 3.8952 2.8289 3.0935 3.6100 2.8690 3.0971 3.1473 6.3095 5.5682 7.1969 1.8639 1.0657 1.1369 1.7029 1.3761 4.4342 1.7883 1.3891 3.8427 1.8544 1.6239 2.2568 1.8376 3.6214 1.4025 3.3261 4.7180 1.4285 1.3485 3.8649 2.1193 3.1699 2.2494 2.8711 2.1723 1.5791 2.0545 2.3455 1.4249 1.7255 1.0568 1.1101 1.6050 1.8174 1.2575 1.3183 1.1622 1.2570 1.1367 1.1036 1.2936 1.2197 1.2602 1.2637 1.3440 1.4375 1.6118 1.6258 2.2999 1.2204 2.9953 2.1324 1.0869 1.0664 1.0750 1.0680 1.0457 1.0904 1.0815 2.3892 1.0916 6.1127 6.1222 1.0849 1.0589 1.0593 1.0847 1.0617 1.0610 1.0365 1.0961 1.0610 1.0586 1.0985 1.1008 1.1027 1.1030 1.1008 1.0993 1.1079 1.0871 1.0868 1.0919 1.0956 1.1011
irintensity: 0.8603 0.0943 0.0185 3.8882 0.0820 1.9614 2.1617 0.6946 0.1750 0.1120 1.6671 0.5745 0.0249 1.3008 0.5624 1.6344 1.1744 0.3559 1.8700 5.6402 8.5005 13.4758 10.2876 1.1570 6.5995 5.6123 43.1750 12.1769 2.0194 61.7667 0.9863 3.2767 16.4914 5.0247 38.5617 3.8565 11.7202 25.2705 15.1177 69.0629 1.5732 30.9885 1.4366 29.3173 0.4417 26.4002 5.2628 9.5265 4.0567 10.4356 1.2622 5.4421 95.8952 7.3648 4.9941 12.1568 0.1756 0.8510 2.8728 1.7530 7.7157 1.6379 4.2467 1.8568 0.0797 1.1426 2.2989 9.4493 11.3519 2.5237 4.1946 11.9719 3.2447 0.0547 29.7814 10.8835 8.1675 8.9987 6.6937 0.1896 0.4676 2.4917 11.3986 4.3164 2.1476 13.3683 25.1303 0.6508 3.0833 72.8814 1.3660 9.6339 38.2990 4.7813 128.3176 39.3014 1.6039 27.3037 56.5224 3.7967 12.4931 47.8208 31.2244 124.5730 58.1165 41.0157 8.0578 0.6217 22.9099 30.6530 16.8976
temp: 298.150 k
press: 1.00000 atm
elementType: 8 8 6 6 6 6 6 6 6 6 6 6 6 6 6 6 6 1 1 1 1 1 1 1 1 1 1 1 1 1 1 1 1 1 1 1 1 1 1
symmnumber: 1
zpe: 881591.0 jmol-1
zpe.correction: 0.335780 hartree
zpe.thermalcorrener: 0.352875 hartree
zpe.thermalcorrenthalpy: 0.353819 hartree
zpe.thermalcorrgfe: 0.287734 hartree
zpe.sumelectzpe: -733.909205 hartree
zpe.sumelectthermal: -733.892111 hartree
zpe.sumelectthermalent: -733.891166 hartree
zpe.sumelectthermalfe: -733.957251 hartree
dipole: -1.0751 -0.4151 -0.5192
dipole: 1.2641
quadrupole: -91.9805 -106.0294 -102.0028
quadrupole: 2.2730 3.0343 -7.3765
quadrupole: 8.0237 -6.0252 -1.9986 2.2730 3.0343 -7.3765
hfenergy: -734.2449853 hartree
pointgroup: C01 [X(C15H22O2)]
dipole: 0.3875729 0.184156 -0.2513949 debye
polarizability: 200.8890321|21.0724978|162.562791|-18.9607457|7.1463619|131.3544447 unknown
InChI: InChI=1S/C15H22O2/c1-2-3-4-8-11-15-16-12-14(17-15)13-9-6-5-7-10-13/h5-7,9-10,14-15H,2-4,8,11-12H2,1H3
charge 0 multiplicity 1
39 atoms
O  0.578422 -0.437664 -0.421488
O  0.971465 -2.453793 0.745478
C  -0.038216 -1.719813 -0.072996
C  -1.318714 -1.496889 0.717119
C  2.024291 -0.745322 -0.584576
C  -2.423044 -0.806161 -0.114462
C  2.262865 -1.747807 0.582984
C  -3.725768 -0.596727 0.688699
C  -4.840611 0.089988 -0.1318
C  2.842701 0.523631 -0.517348
C  -6.142344 0.312518 0.671482
C  3.969605 0.684284 -1.359227
C  2.520855 1.544019 0.413036
C  -7.250684 1.000295 -0.154651
C  4.776083 1.841419 -1.26609
C  3.319902 2.704279 0.499591
C  4.453136 2.854812 -0.335234
H  -0.209079 -2.3164 -0.997809
H  -1.069298 -0.895565 1.611644
H  -1.670388 -2.4849 1.072579
H  2.179709 -1.258237 -1.557856
H  -2.046162 0.169567 -0.477566
H  -2.64374 -1.414404 -1.016885
H  3.048247 -2.488358 0.352833
H  2.510646 -1.211866 1.518026
H  -3.506121 0.012844 1.590187
H  -4.093794 -1.576907 1.058678
H  -5.066088 -0.521807 -1.030632
H  -4.470937 1.067097 -0.507118
H  -6.51094 -0.664284 1.046403
H  -5.915425 0.923572 1.569157
H  4.216461 -0.093825 -2.092636
H  1.630191 1.430491 1.039883
H  -8.167856 1.153123 0.443665
H  -7.521481 0.39232 -1.03875
H  -6.91609 1.989805 -0.519699
H  5.646437 1.954917 -1.92191
H  3.05941 3.493121 1.214296
H  5.072955 3.755725 -0.265106
