program: Gaussian 09
title: 000239569
version: EM64L-G09RevD.01
frameworkgroup: C1[X(C10H20O2)]
method: RPBEPBE
basis: SDD
operation: Freq
keyword: #pfreq=noraman
keyword: PBEPBE/SDD
title: #p freq=noraman PBEPBE/SDD
converged: YES YES NO NO
title: Mulliken charges:
elementType: O O C C C C C C C C C C H H H H H H H H H H H H H H H H H H H H
charge: -0.249850 -0.247156 0.335862 -0.400997 -0.390831 -0.410196 0.063220 -0.735325 -0.425043 -0.722752 -0.392512 -0.685878 0.184652 0.235504 0.230529 0.183971 0.203818 0.196378 0.187523 0.259623 0.209422 0.202236 0.224716 0.224891 0.228780 0.222247 0.219044 0.204623 0.204350 0.211713 0.211723 0.215715
chargesum: 0.00000
title: Mulliken charges with hydrogens summed into heavy atoms:
elementType: O O C C C C C C C C C C
charge: -0.249850 -0.247156 0.335862 0.019159 0.023670 -0.010000 0.250743 -0.064043 0.024563 -0.052682 0.016461 -0.046728
polarizability: 1.42717942e+02 -7.88061189e-01 9.99082602e+01 -1.37719875e+00 1.39912641e-01 9.85706386e+01
1716.lowfreq: -61.1580 -14.2547 -9.6601 0.0007 0.0007 0.0008 7.0818 53.2921 77.7627
frequency: -60.9755 53.2114 77.7117 85.7896 157.7074 174.6512 193.1478 215.4346 232.2963 244.8780 257.4051 299.7304 306.6261 327.1196 358.9198 405.5025 421.8906 487.1211 515.8041 551.7482 627.6949 718.1944 765.3754 773.1873 797.9574 867.4895 892.1482 895.3159 917.3129 925.6095 945.7056 953.2303 957.6884 1002.9947 1023.0392 1057.9048 1065.1954 1069.7840 1096.2659 1121.4695 1133.2911 1171.4700 1188.5486 1201.2392 1230.2621 1241.5910 1262.6790 1273.2686 1288.2988 1315.3669 1326.2422 1335.3694 1341.2576 1348.9562 1357.6083 1377.0737 1386.0077 1392.2148 1395.8094 1448.1065 1452.6917 1454.6947 1464.5730 1472.2902 1472.8440 1476.9083 1480.1649 1486.0872 1487.3000 1491.3129 2864.6724 2914.9981 2924.6410 2956.0356 2971.9598 2974.6191 2980.7944 2985.3961 3005.9159 3006.8228 3018.2400 3065.5725 3066.3384 3071.6709 3073.5208 3074.6341 3076.8660 3081.6890 3084.7649 3097.5423
redmass: 2.3902 3.5489 2.0724 1.9976 2.4386 2.1026 1.2288 2.7452 1.0823 2.8008 1.5706 3.0531 2.4824 2.1989 2.4707 1.9203 2.6142 5.6189 2.8871 4.9679 3.6378 1.2515 2.0186 1.6318 1.8410 2.9182 2.2033 1.4672 2.1419 1.7648 3.8450 1.9093 2.0880 2.4809 1.9735 2.1867 2.0295 2.9114 1.9793 1.5645 2.5148 2.2996 1.7667 1.5543 1.4265 1.2723 1.4463 1.3713 1.0892 1.1829 1.5159 1.4021 1.4527 1.2471 1.2858 1.6036 1.2808 1.2403 1.2002 1.0805 1.0769 1.0765 1.0654 1.0656 1.0634 1.0421 1.0556 1.0720 1.0560 1.0486 1.0831 1.0681 1.0683 1.0592 1.0563 1.0389 1.0370 1.0365 1.0601 1.0998 1.1009 1.1011 1.0962 1.0983 1.0979 1.0993 1.1022 1.0953 1.0993 1.0982
irintensity: 0.0096 0.3508 0.1483 0.1922 1.1247 0.7208 0.1265 2.2058 0.0070 0.2278 0.7039 7.6384 2.9054 2.2417 0.7648 2.2076 2.2002 3.0902 2.3640 3.2653 3.8215 0.3842 7.2809 2.0266 63.5679 16.0370 5.2118 17.8084 3.5297 1.7275 26.0393 33.5382 2.1233 74.7469 0.7559 1.3506 8.0209 95.0681 37.2539 15.8677 10.4288 1.5725 5.4519 5.0355 1.0470 3.2364 2.3532 3.5788 0.2210 3.1145 5.7769 1.4789 0.3766 1.7361 8.1739 31.8467 22.2897 2.5457 19.8784 6.1574 2.5617 7.6564 2.7491 9.2754 3.2859 12.6238 21.9764 12.4074 17.7057 5.2975 69.0936 22.9470 104.7344 56.0847 45.1811 28.1508 19.9777 33.1561 17.2416 29.1659 9.0799 6.2602 4.4704 26.6196 71.2305 47.2811 77.8553 48.5609 39.3238 16.6389
temp: 298.150 k
press: 1.00000 atm
elementType: 8 8 6 6 6 6 6 6 6 6 6 6 1 1 1 1 1 1 1 1 1 1 1 1 1 1 1 1 1 1 1 1
symmnumber: 1
zpe: 747011.0 jmol-1
zpe.correction: 0.284521 hartree
zpe.thermalcorrener: 0.297748 hartree
zpe.thermalcorrenthalpy: 0.298693 hartree
zpe.thermalcorrgfe: 0.245537 hartree
zpe.sumelectzpe: -542.490372 hartree
zpe.sumelectthermal: -542.477145 hartree
zpe.sumelectthermalent: -542.476201 hartree
zpe.sumelectthermalfe: -542.529357 hartree
dipole: 1.5282 -0.3334 -1.6683
dipole: 2.2869
quadrupole: -69.9582 -78.4810 -75.8164
quadrupole: 0.8348 -0.0957 0.6179
quadrupole: 4.7937 -3.7292 -1.0645 0.8348 -0.0957 0.6179
hfenergy: -542.7748934 hartree
pointgroup: C01 [X(C10H20O2)]
dipole: 0.6091375 0.1346626 0.64833 debye
polarizability: 142.7131463|1.4777272|99.942286|0.703884|0.1527275|98.541408 unknown
InChI: InChI=1S/C10H20O2/c1-4-6-9-11-7-10(3,5-2)8-12-9/h9H,4-8H2,1-3H3
charge 0 multiplicity 1
32 atoms
O  -0.350332 1.102235 -0.559427
O  -0.453208 -1.242431 0.010753
C  1.796765 -0.121981 -0.115546
C  1.017526 1.219782 -0.013003
C  0.911575 -1.20114 0.573613
C  3.132527 -0.026739 0.679176
C  -1.101209 0.06584 0.155301
C  2.024285 -0.504219 -1.596841
C  -2.510846 -0.014626 -0.432244
C  4.154898 1.005944 0.152315
C  -3.621949 0.299926 0.596453
C  -5.033211 0.214395 -0.02208
H  0.961179 1.543234 1.052814
H  1.492418 2.016267 -0.607494
H  1.320674 -2.21377 0.418379
H  0.850435 -0.996652 1.667912
H  3.605172 -1.030859 0.680191
H  2.900714 0.207673 1.739767
H  -1.092044 0.329417 1.243667
H  1.056238 -0.667039 -2.099214
H  2.561518 0.291964 -2.142921
H  2.618753 -1.434452 -1.674621
H  -2.651131 -1.031529 -0.842468
H  -2.567622 0.694426 -1.278473
H  4.460541 0.783772 -0.885214
H  3.75116 2.034579 0.1748
H  5.066758 0.99609 0.776877
H  -3.461037 1.314928 1.012271
H  -3.546731 -0.407303 1.446794
H  -5.141713 0.928514 -0.859987
H  -5.231173 -0.799309 -0.418272
H  -5.815732 0.445565 0.723425
