program: Gaussian 09
title: 000239565
version: EM64L-G09RevD.01
frameworkgroup: C1[X(C7H13ClO2)]
method: RPBEPBE
basis: SDD
operation: Freq
keyword: #p
keyword: freq=noraman
keyword: PBEPBE/SDD
title: #p freq=noraman PBEPBE/SDD
converged: YES YES NO NO
title: Mulliken charges:
elementType: Cl O O C C C C C C C H H H H H H H H H H H H H
charge: -0.072629 -0.291446 -0.251728 -0.007464 -0.053383 -0.029216 -0.355593 -0.692439 -0.695748 -0.597305 0.228356 0.207853 0.256289 0.248133 0.214707 0.201722 0.213359 0.247587 0.203538 0.216034 0.243218 0.288029 0.278124
chargesum: 0.00000
title: Mulliken charges with hydrogens summed into heavy atoms:
elementType: Cl O O C C C C C C C
charge: -0.072629 -0.291446 -0.251728 0.220893 0.154469 0.227073 0.107248 -0.029771 -0.032958 -0.031152
polarizability: 1.19861708e+02 4.39708790e+00 7.75262069e+01 6.62095256e+00 2.49442727e+00 7.22760620e+01
1716.lowfreq: -25.1950 -10.1068 -9.2578 0.0017 0.0018 0.0027 34.1500 63.9984 82.4499
frequency: 33.5806 63.8928 82.3797 141.8801 185.7795 200.2851 203.1058 229.8557 264.9913 339.6073 357.8816 391.6938 451.0909 465.6307 655.7893 690.7950 718.0879 830.3650 835.7548 841.4219 881.5525 891.3422 923.8334 932.3735 962.1393 969.0004 1008.5655 1049.3527 1102.4076 1118.5971 1143.4849 1152.1189 1184.8521 1202.5297 1234.4439 1254.1873 1276.4508 1287.4206 1300.6939 1323.0979 1352.0962 1363.3363 1377.6389 1397.2556 1447.4002 1466.6014 1473.4051 1475.0988 1478.6989 1493.3267 2976.4754 2978.7094 2982.9477 3000.4433 3023.5637 3063.0519 3066.8660 3071.1530 3073.8959 3092.1437 3097.4644 3113.9181 3161.0396
redmass: 5.3841 4.1606 3.6618 2.8495 3.4146 2.8116 1.2397 1.1156 3.9266 2.8896 2.5545 2.0583 4.3216 3.8902 5.7217 6.5239 5.0012 2.1438 2.7508 3.3909 3.5797 2.4753 1.1937 2.7452 1.5625 2.2972 1.9469 2.4660 1.6755 2.2120 1.3732 1.9459 1.7874 1.3492 1.2216 1.1751 1.3448 1.2923 1.4913 1.2886 1.3841 1.4401 1.2019 1.2134 1.0976 1.0484 1.0485 1.0858 1.0458 1.0578 1.0369 1.0417 1.0776 1.0666 1.0887 1.0831 1.0982 1.0611 1.0971 1.1000 1.0996 1.1009 1.1120
irintensity: 0.3509 0.5474 0.3916 3.9414 11.6582 4.1183 1.4259 2.7690 2.2652 1.6666 12.9983 0.3317 4.0547 6.9887 48.2854 16.7622 15.3670 20.7696 28.8548 35.6931 12.8977 9.5101 10.1269 15.5296 2.4161 32.3349 38.0952 167.7711 19.3437 4.4057 4.7787 2.4767 0.6461 17.5185 2.0043 3.7481 8.8946 2.0671 0.2785 2.5657 8.9445 0.5966 22.1771 27.4042 14.3845 7.2185 0.7170 5.9305 13.2619 25.4188 21.3768 27.4755 15.0894 45.1485 50.7681 9.7496 3.3191 12.2519 92.9324 20.9847 28.4653 11.0030 6.5367
temp: 298.150 k
press: 1.00000 atm
elementType: 17 8 8 6 6 6 6 6 6 6 1 1 1 1 1 1 1 1 1 1 1 1 1
symmnumber: 1
zpe: 503680.7 jmol-1
zpe.correction: 0.191842 hartree
zpe.thermalcorrener: 0.203199 hartree
zpe.thermalcorrenthalpy: 0.204143 hartree
zpe.thermalcorrgfe: 0.153656 hartree
zpe.sumelectzpe: -884.213211 hartree
zpe.sumelectthermal: -884.201854 hartree
zpe.sumelectthermalent: -884.200910 hartree
zpe.sumelectthermalfe: -884.251397 hartree
dipole: 1.7826 0.2306 -0.6487
dipole: 1.9109
quadrupole: -73.9445 -71.7256 -65.1341
quadrupole: -0.2694 -0.4010 2.3373
quadrupole: -3.6764 -1.4575 5.1339 -0.2694 -0.4010 2.3373
hfenergy: -884.405053 hartree
pointgroup: C01 [X(C7H13Cl1O2)]
dipole: 0.6589986 -0.2756234 0.2344336 debye
dipolederiv: -0.6512927 0.1521966 0.0325584 0.2204945 -0.2608321 -0.0306133 0.1285528 -0.0593658 -0.2228135 -1.3286281 0.0480447 0.0499474 0.0605188 -0.4758631 -0.0402416 0.0571698 -0.0195264 -0.3697715 -0.8190171 0.1455425 0.1171772 0.107546 -0.6069108 -0.092001 0.0831456 -0.1011432 -0.452312 1.2611037 -0.1646892 -0.0504407 0.028339 0.5635344 0.0878483 -0.0461811 0.0499172 0.5020166 -0.0770107 0.0550276 -0.0401121 0.0176435 0.0395963 0.0012048 -0.0737958 0.0339583 0.0510291 0.6495858 -0.0755036 -0.0302422 -0.2491754 0.2070581 0.0024173 0.0524577 -0.1198028 0.2270367 0.373578 -0.0911176 -0.1118441 0.0672967 0.111766 -0.0495875 -0.0966529 0.0659539 0.4001856 -0.0152994 0.0138623 0.0046119 -0.029788 -0.0676269 -0.0130998 -0.0362535 0.0180755 0.1005437 -0.0546416 -0.0464025 0.0084364 0.004495 -0.0525438 0.0132407 -0.0508254 0.0148131 0.0983739 0.6656952 -0.1885987 -0.1632158 -0.2987864 0.2492507 0.062861 -0.2362102 0.0986267 0.1476479 -0.0386743 0.0251754 0.0552998 0.0043365 0.037786 -0.0129449 0.0802025 -0.0152755 -0.1400013 0.0179546 0.0040566 0.0849844 0.0019349 0.0309895 -0.0324039 0.0798018 -0.0301095 -0.1438873 -0.0256041 -0.0150344 0.0469302 -0.0314733 0.0382727 0.0677825 0.0563128 0.0690623 -0.0534615 0.0466291 0.1039029 0.0325733 0.0974773 -0.006626 -0.0141993 0.0114855 0.0261689 0.0814514 -0.0405188 -0.0072001 -0.0845346 -0.034934 0.0741959 0.0571491 -0.0408318 -0.0128971 -0.1702729 0.080897 0.0207171 0.0519281 -0.000019 0.0633242 0.0180543 0.0827955 -0.0610399 -0.1561255 -0.0975271 0.1078774 -0.1073155 0.0760144 0.0425242 0.0135523 -0.1248487 0.0468051 0.0125107 0.0073938 -0.1436922 0.0391972 -0.1213882 -0.0008548 0.0187281 0.0422714 0.0209211 0.0848651 0.0655447 -0.0189747 0.0285683 0.0017825 0.0807307 -0.0524641 0.1019368 -0.0088752 -0.1532295 -0.1292084 0.0277163 -0.0936605 0.0511628 0.0826255 0.0536345 -0.1250258 0.0369954 0.0107294 0.120703 0.0471689 0.0172284 0.0097995 -0.1323127 -0.0340126 0.0194574 -0.0374274 0.0853577 -0.0262559 0.0004243 0.008267 -0.0266437 -0.0366594 -0.0839083 -0.0117211 -0.0599542 0.0636773 0.0145934 -0.0004996 0.1036576 0.0433667 0.0185754 0.0590036 0.0467566 0.0441193 -0.00355 unknown
polarizability: 116.3160336|-12.1511741|80.1460186|-6.6578974|4.7156676|73.2019246 unknown
InChI: InChI=1S/C7H13ClO2/c1-5(2)7-9-4-6(3-8)10-7/h5-7H,3-4H2,1-2H3
charge 0 multiplicity 1
23 atoms
Cl -4.104393 1.086443 0.109826
O  -0.461121 -0.819193 -0.233272
O  0.256987 1.434724 -0.254411
C  0.703132 0.064252 -0.543193
C  1.931195 -0.366481 0.280372
C  -1.522971 0.019638 0.388181
C  -0.775496 1.305262 0.798221
C  2.275304 -1.845991 -0.007643
C  3.123384 0.567953 -0.030297
C  -2.604051 0.234292 -0.675165
H  0.90467 0.020847 -1.630189
H  1.662723 -0.266726 1.352083
H  -1.928072 -0.535831 1.250603
H  -1.400076 2.209879 0.758296
H  -0.314849 1.199498 1.798978
H  2.554604 -1.985419 -1.070085
H  3.134184 -2.16703 0.609187
H  1.41737 -2.503675 0.21189
H  3.432657 0.472998 -1.089341
H  3.993365 0.303452 0.597496
H  2.862517 1.623943 0.156836
H  -2.974177 -0.72193 -1.069126
H  -2.261586 0.896495 -1.484147
