program: Gaussian 09
title: 000239563
version: EM64L-G09RevD.01
frameworkgroup: C1[X(C15H14O2)]
method: RPBEPBE
basis: SDD
operation: Freq
keyword: #pfreq=noraman
keyword: PBEPBE/SDD
title: #p freq=noraman PBEPBE/SDD
converged: YES YES NO NO
title: Mulliken charges:
elementType: O O C C C C C C C C C C C C C C C H H H H H H H H H H H H H H
charge: -0.271499 -0.239150 -0.237933 -0.155072 -0.370658 0.500499 0.351023 -0.344818 -0.459025 -0.373521 -0.371663 -0.229966 -0.218809 -0.216861 -0.217627 -0.239173 -0.236792 0.223503 0.255413 0.225822 0.246417 0.257432 0.230260 0.265941 0.259628 0.225905 0.226597 0.228023 0.227967 0.228828 0.229308
chargesum: 0.00000
title: Mulliken charges with hydrogens summed into heavy atoms:
elementType: O O C C C C C C C C C C C C C C C
charge: -0.271499 -0.239150 -0.014430 0.100341 0.101581 0.500499 0.351023 -0.087386 -0.228765 -0.107580 -0.112035 -0.004061 0.007787 0.011162 0.010340 -0.010345 -0.007484
polarizability: 2.24699016e+02 2.80311582e+00 1.45822267e+02 1.29785319e+01 6.16981109e+00 1.03095679e+02
1716.lowfreq: -15.4675 -7.7498 -0.0008 -0.0006 0.0004 5.0139 14.1082 25.1780 40.7766
frequency: 13.2227 24.7381 40.3971 53.9290 105.6275 157.7273 193.0390 216.5991 270.5703 309.4193 360.9620 402.8843 404.3104 454.5073 459.2226 530.6209 578.2503 605.0980 613.6473 614.7543 699.6888 704.4328 706.4310 721.6069 742.7294 760.4340 772.2292 851.2811 852.9295 862.1370 870.6152 884.1634 917.8482 928.5943 941.0270 966.2582 976.2463 988.4300 989.3076 989.9272 995.9681 1001.0671 1010.2016 1026.0453 1029.0797 1036.6158 1078.8366 1084.8478 1171.3111 1171.7806 1174.0707 1180.0660 1186.0692 1202.0969 1220.9876 1235.1603 1257.2844 1290.0066 1303.4589 1312.1196 1323.0401 1350.8566 1382.0564 1390.7782 1433.6513 1444.8643 1465.8448 1476.3401 1484.7193 1591.9751 1596.3125 1611.5411 1615.4993 2994.1244 3013.2762 3053.2077 3114.5963 3118.1260 3123.8228 3126.6581 3133.5433 3139.1124 3146.4370 3151.2564 3155.4354 3164.6310 3166.1236
redmass: 5.1884 3.8214 4.2358 4.7137 4.6293 4.3652 4.8195 3.9379 5.0365 3.4165 6.1565 2.8104 2.8826 5.2417 3.8332 3.2680 4.5883 6.0968 6.4244 6.4237 5.1999 1.7080 2.7205 3.5473 1.8387 3.7326 1.9547 2.7530 1.3672 1.7441 2.3003 5.4886 2.0459 2.4919 1.5965 4.2802 1.4048 2.0906 2.5621 5.3495 1.3237 1.4224 2.7090 2.1673 2.0085 2.6572 1.5579 1.5880 1.0541 1.0675 1.1885 1.1636 1.1135 2.5965 1.7143 1.2223 1.2447 1.3072 1.5321 1.3144 1.2597 1.5245 8.8866 5.0347 2.1880 2.1122 1.1025 2.2662 2.3251 6.3320 6.0831 6.0707 6.0925 1.0713 1.0803 1.0873 1.0874 1.1012 1.0847 1.0864 1.0881 1.0916 1.0926 1.0958 1.0959 1.1014 1.1011
irintensity: 0.2294 0.1950 0.4199 0.7220 1.0248 0.5486 6.9024 1.5811 2.6458 1.6450 11.1097 0.3915 0.0244 1.7493 5.8916 8.8136 9.8742 17.8862 0.0951 0.3129 5.5040 74.7690 23.2482 22.4250 59.0475 7.1857 46.4790 14.4331 0.9654 29.4352 36.4243 37.7692 2.1756 15.0398 50.3914 65.3737 0.8139 1.4336 0.7870 2.6963 1.0257 15.3786 33.5690 19.4369 8.3070 67.2902 3.9418 10.0637 0.1495 0.1512 5.2199 19.3104 0.8272 43.5860 5.2716 0.5015 1.5937 76.5652 2.4395 0.8980 1.2214 4.2798 0.1583 1.1653 12.4905 11.8935 7.6638 8.3506 9.5931 0.4363 0.5439 0.4556 2.3535 18.0956 56.0750 16.2987 7.7914 26.1712 0.0621 0.3616 7.4460 21.4473 16.7759 31.6274 23.6312 22.7483 19.7025
temp: 298.150 k
press: 1.00000 atm
elementType: 8 8 6 6 6 6 6 6 6 6 6 6 6 6 6 6 6 1 1 1 1 1 1 1 1 1 1 1 1 1 1
symmnumber: 1
zpe: 653584.2 jmol-1
zpe.correction: 0.248937 hartree
zpe.thermalcorrener: 0.262783 hartree
zpe.thermalcorrenthalpy: 0.263727 hartree
zpe.thermalcorrgfe: 0.205058 hartree
zpe.sumelectzpe: -729.211226 hartree
zpe.sumelectthermal: -729.197380 hartree
zpe.sumelectthermalent: -729.196436 hartree
zpe.sumelectthermalfe: -729.255105 hartree
dipole: 0.2160 0.9016 1.5745
dipole: 1.8271
quadrupole: -85.3502 -95.5909 -100.0414
quadrupole: 1.3506 1.2283 3.2597
quadrupole: 8.3106 -1.9301 -6.3806 1.3506 1.2283 3.2597
hfenergy: -729.4601631 hartree
pointgroup: C01 [X(C15H14O2)]
dipole: 0.152088 0.0335587 -0.701772 debye
polarizability: 224.3178378|13.3706721|130.8381695|-4.6063041|21.6925165|118.4609554 unknown
InChI: InChI=1S/C15H14O2/c1-3-7-12(8-4-1)14-11-16-15(17-14)13-9-5-2-6-10-13/h1-10,14-15H,11H2
charge 0 multiplicity 1
31 atoms
O  -0.132826 -0.593787 0.819412
O  0.132035 1.724823 0.79029
C  -0.746099 -0.139736 -0.471327
C  0.752911 0.487223 1.277353
C  -0.326151 1.369555 -0.572598
C  -2.241257 -0.388232 -0.428972
C  2.188167 0.317731 0.774435
C  -3.020189 0.086122 0.657347
C  -2.880884 -1.069414 -1.492134
C  2.690729 -0.966489 0.45465
C  3.037857 1.447661 0.674431
C  -4.416585 -0.113935 0.673027
C  -4.280999 -1.268544 -1.479511
C  4.03138 -1.11961 0.033086
C  4.37725 1.29289 0.252509
C  -5.052321 -0.790053 -0.396692
C  4.877671 0.008812 -0.067966
H  -0.289841 -0.716095 -1.298269
H  0.690212 0.515063 2.378404
H  0.50082 1.498738 -1.296557
H  -1.16266 2.040219 -0.814882
H  -2.521189 0.596315 1.488563
H  -2.283491 -1.451086 -2.330019
H  2.023107 -1.831055 0.53357
H  2.639159 2.439516 0.914671
H  -5.010759 0.252104 1.517972
H  -4.76545 -1.799714 -2.306514
H  4.414011 -2.11592 -0.215779
H  5.028684 2.170535 0.172492
H  -6.136764 -0.947002 -0.381788
H  5.917172 -0.110233 -0.394005
