program: Gaussian 09
title: 000239562
version: EM64L-G09RevD.01
frameworkgroup: C1[X(C7H9Cl3O4)]
method: RPBEPBE
basis: SDD
operation: Freq
keyword: #p
keyword: freq=noraman
keyword: PBEPBE/SDD
title: #p freq=noraman PBEPBE/SDD
converged: YES YES NO NO
title: Mulliken charges:
elementType: Cl Cl Cl O O O O C C C C C C C H H H H H H H H H
charge: -0.046419 -0.003362 -0.001964 -0.266127 -0.248041 -0.207130 -0.206629 0.034760 -0.346631 -0.625088 0.365145 0.350893 -0.700501 -0.695233 0.298109 0.242989 0.275433 0.287380 0.310005 0.297644 0.294860 0.293901 0.296004
chargesum: 0.00000
title: Mulliken charges with hydrogens summed into heavy atoms:
elementType: Cl Cl Cl O O O O C C C C C C C
charge: -0.046419 -0.003362 -0.001964 -0.266127 -0.248041 -0.207130 -0.206629 0.332869 0.171791 -0.027703 0.365145 0.350893 -0.107996 -0.105328
polarizability: 1.21733149e+02 2.32871225e+00 1.15519891e+02 -8.35953598e+00 -9.30408021e+00 9.72686301e+01
1716.lowfreq: -6.1803 -3.9092 0.0019 0.0025 0.0026 2.9233 13.9905 19.2812 30.1447
frequency: 13.8794 19.1677 30.1337 35.1322 51.5714 54.4951 65.8358 105.1644 108.4321 168.2935 175.6566 205.5061 244.5936 273.1557 298.3960 373.0967 405.9136 431.1656 529.3344 549.3888 588.7103 640.0079 650.5101 660.9494 727.5532 746.7539 796.5546 841.5852 881.4758 913.9466 915.2919 916.8242 967.8494 988.5110 1026.2309 1094.4583 1113.1840 1117.9416 1156.0137 1159.6277 1179.0455 1250.8480 1261.0723 1285.1430 1287.1681 1314.3518 1324.3966 1379.2642 1422.9125 1424.0277 1430.6696 1445.8895 1671.8465 1674.8297 3018.1817 3045.1843 3058.1872 3059.6761 3067.6406 3134.2668 3136.7281 3143.3476 3152.6229
redmass: 14.3087 5.8141 6.7903 6.2607 5.4400 9.1760 4.6292 7.8846 4.9887 11.2351 5.4164 7.5026 10.1299 5.8238 4.7264 3.2484 3.6202 4.5220 3.2170 3.2881 5.7345 5.5865 5.4438 6.8213 5.6540 6.1646 4.5803 5.9934 1.8126 3.4489 1.8225 2.3193 4.8501 2.4650 2.1205 3.4085 3.3055 2.0928 1.1151 1.1799 1.2345 1.3993 1.1651 1.3633 1.4166 1.2869 1.3466 1.3837 1.0884 1.0898 1.0869 1.0929 10.2877 10.7326 1.0834 1.0621 1.0580 1.0573 1.0586 1.1070 1.1063 1.1038 1.1096
irintensity: 1.3557 3.5203 0.6920 1.0058 1.0157 2.6127 9.4109 5.5260 8.0373 0.1045 0.3409 0.2509 4.2346 2.0917 7.7013 12.5743 18.5567 10.9595 1.7334 8.5310 14.5451 11.1349 10.6020 22.9337 19.9457 24.7987 6.3307 15.1806 2.1469 62.9972 3.5749 35.8244 92.2161 22.9028 54.0645 396.9236 246.6093 70.6459 1.6764 34.9077 9.5254 11.9487 2.0840 28.0053 21.9753 11.8621 12.0210 3.9494 21.3507 49.4853 16.2096 21.8900 56.6677 199.5734 4.6216 14.5533 7.2284 8.1760 5.9514 0.6969 1.0216 0.9906 3.2966
temp: 298.150 k
press: 1.00000 atm
elementType: 17 17 17 8 8 8 8 6 6 6 6 6 6 6 1 1 1 1 1 1 1 1 1
symmnumber: 1
zpe: 413965.3 jmol-1
zpe.correction: 0.157671 hartree
zpe.thermalcorrener: 0.173891 hartree
zpe.thermalcorrenthalpy: 0.174835 hartree
zpe.thermalcorrgfe: 0.107282 hartree
zpe.sumelectzpe: -1952.118767 hartree
zpe.sumelectthermal: -1952.102547 hartree
zpe.sumelectthermalent: -1952.101603 hartree
zpe.sumelectthermalfe: -1952.169156 hartree
dipole: -0.3277 1.4841 -3.4173
dipole: 3.7400
quadrupole: -114.7492 -108.7739 -102.4339
quadrupole: 1.2833 4.8962 6.5431
quadrupole: -6.0968 -0.1216 6.2184 1.2833 4.8962 6.5431
hfenergy: -1952.2764379 hartree
pointgroup: C01 [X(C7H9Cl3O4)]
dipole: -0.2520068 0.6789505 1.2808903 debye
dipolederiv: -0.2085285 0.0629704 -0.1027196 0.035323 -0.2088876 0.0350432 -0.1038034 0.1184571 -0.4661788 -0.2995619 -0.0687719 0.1208569 -0.0475494 -0.1403041 0.034465 0.170088 0.0702108 -0.2395573 -0.2381475 0.0253459 -0.1203249 -0.0039249 -0.1205737 -0.0187796 -0.1660946 0.0369312 -0.3041812 -1.272395 -0.3550366 0.650041 -0.3355928 -0.5674799 0.2054103 0.6351384 0.139273 -0.7709244 -1.1316842 0.1647101 -0.5445735 0.1605946 -0.5334616 0.0803655 -0.7400219 0.1093831 -0.8185026 -0.5135883 -0.1700622 0.0607346 -0.0050339 -0.5522154 -0.2808078 0.2811576 -0.1159405 -0.7013543 -0.5785036 0.0498668 -0.1865703 -0.1969336 -0.7807402 -0.1516553 -0.2199447 0.0140349 -0.4193928 0.663604 0.2401615 -0.2822521 0.3886477 0.4073451 -0.2346958 -0.1013555 -0.0692788 0.0025535 0.5192761 -0.1926429 0.1632671 -0.3723324 0.3142525 -0.2144922 0.2572272 -0.0956846 0.3723006 0.0274046 -0.0198133 0.2075744 -0.082432 0.0880814 -0.0432564 0.1890861 -0.1198911 0.6850215 1.1931898 0.4744618 -0.5514741 0.3515381 0.7513009 0.2175585 -0.7235646 0.1244091 1.1052705 1.2066849 -0.1210335 0.6947896 0.0854215 1.0307537 0.0380968 0.8115467 -0.0277079 0.7513313 0.2549299 -0.0565805 -0.2212063 -0.1536272 -0.0489931 -0.0760136 -0.3731845 -0.2183511 0.3433277 0.2183234 0.0946019 0.1449549 0.2177344 -0.140546 0.1701165 0.2326889 0.0030666 0.4638111 0.065036 -0.0277063 0.0092923 -0.0481637 0.0094106 0.0994067 -0.0774833 -0.0111936 -0.0051918 -0.0316641 -0.0618377 0.0482552 0.0159887 -0.0235383 0.0887712 -0.0073561 0.0145331 0.074561 0.0585194 0.0129055 -0.0862022 0.0423409 0.0660473 -0.0363255 -0.0597526 -0.0230351 0.0234894 0.0221153 -0.0975714 -0.0506791 -0.100751 0.0353477 0.0289392 -0.0282467 0.0205249 -0.0262691 -0.0102487 0.0645176 -0.0065517 0.0637358 0.1134786 0.0009283 0.0023152 -0.01609 -0.0476781 0.0260762 -0.0242502 0.0250551 -0.0041471 0.1067442 0.0597048 0.0159831 0.0489262 -0.0456629 0.0002313 0.0573512 0.0816306 0.0301154 0.0215214 0.0057123 0.0865532 0.0104905 0.0608991 -0.0018735 -0.0898994 -0.0413762 -0.068124 0.0680701 0.0118814 -0.0688558 0.0173636 0.0223112 0.0308044 0.038313 -0.0125215 0.027172 0.1043863 -0.0203734 -0.0121209 -0.0304314 -0.0599838 unknown
polarizability: 120.494046|2.989556|94.6924271|6.7192732|-7.5564613|119.335197 unknown
InChI: InChI=1S/C7H9Cl3O4/c8-1-5(14-7(12)3-10)4-13-6(11)2-9/h5H,1-4H2
charge 0 multiplicity 1
23 atoms
Cl 1.278136 -2.455603 2.587983
Cl 4.460687 1.146741 -1.910399
Cl -4.236329 1.032623 -2.540945
O  1.335495 -0.111406 0.312364
O  -1.588858 0.525176 0.448548
O  2.20083 -0.957674 -1.688873
O  -2.796938 -1.069792 -0.760236
C  0.25352 -1.140721 0.291715
C  -0.877708 -0.574884 1.153732
C  0.772027 -2.495795 0.771368
C  2.246099 -0.138636 -0.754393
C  -2.557351 0.119301 -0.483132
C  3.24578 0.985504 -0.5188
C  -3.233409 1.373903 -1.017123
H  -0.07584 -1.277673 -0.756978
H  -1.596398 -1.375497 1.401214
H  -0.481479 -0.10996 2.066801
H  -0.016483 -3.259726 0.694198
H  1.664528 -2.805888 0.211337
H  3.816834 0.788612 0.401415
H  2.717839 1.945437 -0.42018
H  -2.480647 2.134448 -1.268547
H  -3.921736 1.77721 -0.257873
