program: Gaussian 09
title: 000239558
version: EM64L-G09RevD.01
frameworkgroup: C1[X(C14H20O4)]
method: RPBEPBE
basis: SDD
operation: Freq
keyword: #pfreq=noraman
keyword: PBEPBE/SDD
title: #p freq=noraman PBEPBE/SDD
converged: NO YES NO NO
title: Mulliken charges:
elementType: O O O O C C C C C C C C C C C C C C H H H H H H H H H H H H H H H H H H H H
charge: -0.232793 -0.254222 -0.306077 -0.299979 0.286097 -0.369723 -0.370414 -0.695720 -0.733915 -0.144586 0.516927 -0.491656 -0.436142 0.227482 -0.343298 0.187630 -0.530000 -0.530366 0.183118 0.232448 0.230825 0.186661 0.258881 0.204245 0.202983 0.210904 0.220024 0.220580 0.195913 0.281624 0.232007 0.249415 0.250506 0.224389 0.228424 0.223641 0.227583 0.256585
chargesum: 0.00000
title: Mulliken charges with hydrogens summed into heavy atoms:
elementType: O O O O C C C C C C C C C C C C C C
charge: -0.232793 -0.254222 -0.306077 -0.299979 0.286097 0.045843 0.047072 -0.029612 -0.082408 0.051327 0.516927 -0.210032 -0.204135 0.227482 -0.093883 0.187630 0.173319 0.177443
polarizability: 2.28554255e+02 -4.11717432e+00 1.57878404e+02 -7.72537550e+00 4.67087091e+00 1.15497429e+02
1716.lowfreq: -29.9723 -12.7604 -7.2833 -0.0003 0.0002 0.0005 1.4203 40.5694 51.2799
frequency: -23.5555 40.5194 51.2603 89.3264 105.8928 115.9751 141.8484 158.4449 165.1015 171.2245 193.0426 199.2000 207.1013 210.6177 243.5222 267.8425 285.8004 313.0949 338.4584 350.8806 390.0701 403.1543 419.8263 439.7942 483.6986 491.9056 509.6941 569.1222 575.5580 619.2251 644.3792 707.6376 748.1444 761.6519 788.4085 820.1471 857.9887 890.0777 899.0337 914.1780 920.9135 929.2594 940.1015 941.6752 945.9825 951.3706 952.8769 983.6927 1017.1261 1018.1190 1046.0547 1092.7296 1112.1300 1115.9184 1140.7796 1152.2773 1157.3091 1176.0150 1191.3460 1194.3542 1201.4893 1242.7873 1245.4201 1268.4191 1303.7761 1306.9743 1336.0233 1352.1057 1359.1044 1376.1273 1382.5905 1396.7924 1400.3208 1422.6150 1443.3789 1445.3888 1453.8204 1457.0237 1459.4242 1465.8781 1470.2817 1477.8068 1478.4400 1486.7006 1487.3697 1488.9299 1580.0740 1617.9400 2876.3566 2920.4139 2932.1596 2967.4598 2970.7088 2973.5578 2979.4345 3060.6320 3064.4873 3066.4912 3067.0424 3070.5063 3073.8088 3076.0051 3099.6063 3119.2716 3121.3818 3132.4483 3164.0243 3177.6517
redmass: 3.8340 4.1111 3.5832 3.6164 2.7772 3.5789 3.4263 1.1517 1.0335 1.1124 2.0665 1.5871 2.6102 4.6862 3.9761 2.7206 5.1122 3.5398 2.7905 3.8748 2.1981 2.0197 3.7503 4.5277 5.4083 3.8576 4.5432 5.1484 7.0617 5.2409 4.2569 5.8249 3.6541 4.0100 3.9204 1.8150 2.6544 2.6942 2.7351 3.7735 1.9627 2.0566 1.8775 1.5104 5.4664 2.0198 1.9839 3.8472 2.0301 1.6091 3.0849 2.7494 1.2447 1.2423 1.5210 1.3132 1.5114 1.9182 1.7534 1.3718 1.7702 1.8529 2.0658 2.1861 1.8782 1.1457 1.2182 2.5502 1.4310 1.2408 3.2723 1.2376 2.0940 1.1785 1.3742 1.0828 1.0747 1.0613 1.0636 1.0486 1.0753 1.0669 1.0574 1.1200 1.4988 1.5236 7.4009 6.7995 1.0828 1.0677 1.0678 1.0356 1.0306 1.0308 1.0370 1.0988 1.0993 1.1043 1.0979 1.1040 1.0961 1.0963 1.0982 1.1025 1.1030 1.0890 1.0956 1.0923
irintensity: 0.2689 1.4342 3.0043 2.6855 7.7221 0.4081 2.7651 0.1895 0.0418 0.2412 4.4276 3.4068 1.0313 0.6383 9.8427 2.4859 10.3057 2.9476 0.8119 0.5232 0.1329 2.6895 4.8630 2.7020 1.2947 8.4813 3.0689 4.0732 4.9269 14.2950 11.7812 16.4970 8.6130 5.7782 3.7493 100.4573 15.1487 5.7462 50.5699 13.3356 6.6602 8.0192 38.8591 12.0414 60.1008 10.7544 3.3109 85.6872 45.1616 14.0466 190.3265 67.7604 10.1159 4.4371 10.2387 0.4777 10.9810 8.3508 17.7437 3.7555 2.5057 96.2813 45.3128 1.5039 28.8504 4.6164 1.8039 137.4538 1.3663 18.4742 46.0656 25.0746 14.8740 0.6664 20.2543 7.4964 1.3274 11.6051 6.0878 1.3964 19.2746 8.4178 10.0938 21.5939 12.2444 83.6449 11.2594 7.1779 57.7287 33.0431 123.7694 47.9610 82.1228 63.3456 30.4588 26.5669 0.0453 29.3998 4.1462 23.2242 83.3315 40.2796 20.7961 24.5684 25.8984 9.7682 9.3762 0.3474
temp: 298.150 k
press: 1.00000 atm
elementType: 8 8 8 8 6 6 6 6 6 6 6 6 6 6 6 6 6 6 1 1 1 1 1 1 1 1 1 1 1 1 1 1 1 1 1 1 1 1
symmnumber: 1
zpe: 824725.5 jmol-1
zpe.correction: 0.314121 hartree
zpe.thermalcorrener: 0.332151 hartree
zpe.thermalcorrenthalpy: 0.333096 hartree
zpe.thermalcorrgfe: 0.268955 hartree
zpe.sumelectzpe: -844.935185 hartree
zpe.sumelectthermal: -844.917155 hartree
zpe.sumelectthermalent: -844.916210 hartree
zpe.sumelectthermalfe: -844.980351 hartree
dipole: 1.8859 -0.2643 -0.5747
dipole: 1.9892
quadrupole: -84.9106 -103.2030 -108.9274
quadrupole: -4.9234 -4.9089 -0.6647
quadrupole: 14.1031 -4.1894 -9.9137 -4.9234 -4.9089 -0.6647
hfenergy: -845.249306 hartree
pointgroup: C01 [X(C14H20O4)]
dipole: 0.7412925 -0.1579719 -0.194894 debye
polarizability: 228.3934755|-7.3374759|158.7371582|-4.9031014|-1.3144614|114.7994551 unknown
InChI: InChI=1S/C14H20O4/c1-14(2)8-17-13(18-9-14)10-5-6-11(15-3)12(7-10)16-4/h5-7,13H,8-9H2,1-4H3
charge 0 multiplicity 1
38 atoms
O  1.898923 -0.896521 0.967493
O  1.905347 0.410047 -1.066781
O  -2.762904 1.912644 0.018553
O  -4.355695 -0.542249 0.013339
C  4.023264 0.238446 0.270372
C  3.374579 -0.99811 0.94966
C  3.380159 0.355483 -1.137724
C  3.746093 1.514044 1.099845
C  5.543604 0.000582 0.117393
C  1.380472 -0.784059 -0.408753
C  -0.124193 -0.696074 -0.341004
C  -0.764689 0.557652 -0.215895
C  -0.901374 -1.877152 -0.378542
C  -2.166764 0.633719 -0.113343
C  -2.304868 -1.808958 -0.249966
C  -2.945727 -0.561113 -0.096507
C  -3.645077 2.292585 -1.109589
C  -4.870109 0.033539 1.279206
H  3.67574 -1.926995 0.412096
H  3.670201 -1.080871 2.00884
H  3.680017 1.288963 -1.642403
H  3.683214 -0.513255 -1.76617
H  2.661208 1.667853 1.224008
H  4.201951 1.434074 2.104494
H  4.171218 2.406054 0.602612
H  5.760264 -0.908535 -0.476322
H  6.027141 0.858633 -0.386066
H  6.022355 -0.117547 1.10743
H  1.725655 -1.684717 -0.975519
H  -0.179407 1.480836 -0.221513
H  -0.411645 -2.851807 -0.486089
H  -2.924742 -2.710919 -0.254579
H  -4.463539 1.560741 -1.236867
H  -3.056547 2.36306 -2.04391
H  -4.048898 3.282019 -0.845666
H  -4.558433 -0.596459 2.133663
H  -5.966391 0.019085 1.18213
H  -4.5037 1.065683 1.422076
