program: Gaussian 09
title: 000239557
version: EM64L-G09RevD.01
frameworkgroup: C1[X(C12H15ClO4)]
method: RPBEPBE
basis: SDD
operation: Freq
keyword: #p
keyword: freq=noraman
keyword: PBEPBE/SDD
title: #p freq=noraman PBEPBE/SDD
converged: YES YES NO NO
title: Mulliken charges:
elementType: Cl O O O O C C C C C C C C C C C C H H H H H H H H H H H H H H H
charge: -0.070208 -0.269796 -0.245907 -0.240045 -0.235188 -0.020725 -0.163657 -0.344708 0.373893 -0.613615 -0.499563 -0.415829 0.226943 -0.324797 0.199876 -0.536551 -0.538350 0.258096 0.257800 0.223583 0.245445 0.284119 0.286409 0.278645 0.257594 0.244882 0.247371 0.223055 0.221520 0.248661 0.220065 0.220985
chargesum: 0.00000
title: Mulliken charges with hydrogens summed into heavy atoms:
elementType: Cl O O O O C C C C C C C C C C C C
charge: -0.070208 -0.269796 -0.245907 -0.240045 -0.235188 0.237371 0.094143 0.124319 0.373893 -0.043086 -0.220918 -0.158235 0.226943 -0.079915 0.199876 0.155394 0.151361
polarizability: 1.85723950e+02 8.14240672e+00 1.52253590e+02 -9.08352558e+00 1.03609686e+01 1.23179183e+02
1716.lowfreq: -5.7052 -1.3568 -0.0021 0.0010 0.0011 11.5546 19.4790 30.9424 74.7219
frequency: 19.4784 30.9306 74.7155 90.7412 96.7970 105.3727 128.6442 155.6152 161.1854 182.7807 193.3585 240.8563 263.3720 267.6034 300.2430 322.4325 355.5321 375.6090 413.4687 433.3511 463.4123 485.5976 559.3171 584.0292 614.3122 637.0979 668.8949 691.8512 729.7694 741.0690 783.2468 815.0066 827.1634 849.5793 876.0872 894.1649 903.6883 930.0592 946.7619 964.8938 982.7560 997.3730 1022.3641 1037.3110 1112.1863 1112.7264 1115.9718 1128.5248 1143.0737 1148.6191 1157.5502 1174.5793 1206.1239 1217.3916 1238.2075 1244.4422 1260.9309 1272.1194 1284.4981 1293.2533 1315.6588 1359.0154 1386.6367 1409.2845 1436.2697 1443.5504 1453.7236 1467.2826 1468.3266 1470.6207 1472.0717 1476.5852 1504.7956 1588.9869 1607.5450 2958.8202 2960.3345 2998.7489 3046.9073 3048.2288 3048.6428 3052.6130 3068.8273 3125.1118 3127.6881 3127.9850 3147.6060 3159.1863 3163.3816 3168.6394
redmass: 7.1865 5.8215 3.6484 3.6699 3.4681 3.5486 4.5213 3.8535 4.6389 3.9365 2.1804 1.2088 3.1664 1.5834 5.4196 7.9573 4.6507 4.2286 2.3842 5.3231 3.4529 6.8708 5.4703 3.9655 6.1332 4.7016 6.0952 8.3592 5.1745 3.4743 3.7323 1.8406 2.4353 3.3894 2.0479 1.8023 2.9396 3.6649 1.6013 3.3543 8.3635 5.3854 4.5243 1.3946 1.2612 1.2611 2.5542 2.0531 1.5303 1.3626 1.4050 1.5688 1.2922 2.3328 1.1849 1.1600 4.0623 1.4225 1.2550 1.2668 1.2283 1.4282 3.8277 4.4822 1.1855 1.3234 1.0975 1.0508 1.0522 1.0893 1.0583 1.0911 2.7104 7.5810 6.6274 1.0330 1.0331 1.0674 1.1039 1.1037 1.0861 1.0883 1.0572 1.0999 1.0992 1.0994 1.0873 1.1118 1.0902 1.0953
irintensity: 0.0203 0.0208 4.0184 2.8824 11.2009 0.3404 0.1588 1.6170 3.4477 9.2549 4.7056 1.5803 0.8463 2.2328 6.4749 3.2541 2.9722 3.6223 6.3506 1.6681 1.7585 1.6290 23.2504 5.6186 7.5906 13.3332 55.4621 1.5676 28.2236 2.6638 32.2053 30.3321 28.5537 65.0945 14.7501 26.6842 22.6243 6.7108 14.8488 3.1631 33.1682 66.4964 114.6164 3.5142 0.0578 0.2884 1.0363 166.2332 12.8382 1.0672 6.2392 32.0215 5.7557 60.8613 3.6041 1.3260 270.2998 12.4972 17.0584 48.5634 4.5885 1.9478 33.7486 14.0857 16.6617 8.0972 7.8996 12.0755 18.6568 68.0390 35.2458 8.4122 115.9675 37.7526 37.3691 106.3346 22.0493 31.3642 36.3295 53.6738 23.4496 23.3115 11.2334 23.5780 9.2000 35.2754 5.4099 11.2423 6.1367 6.7887
temp: 298.150 k
press: 1.00000 atm
elementType: 17 8 8 8 8 6 6 6 6 6 6 6 6 6 6 6 6 1 1 1 1 1 1 1 1 1 1 1 1 1 1 1
symmnumber: 1
zpe: 660285.8 jmol-1
zpe.correction: 0.251490 hartree
zpe.thermalcorrener: 0.268392 hartree
zpe.thermalcorrenthalpy: 0.269336 hartree
zpe.thermalcorrgfe: 0.205216 hartree
zpe.sumelectzpe: -1225.878956 hartree
zpe.sumelectthermal: -1225.862054 hartree
zpe.sumelectthermalent: -1225.861110 hartree
zpe.sumelectthermalfe: -1225.925230 hartree
dipole: -1.4724 -0.6782 -0.3039
dipole: 1.6493
quadrupole: -111.7050 -93.6062 -111.2043
quadrupole: 5.6289 -0.5714 7.8780
quadrupole: -6.1998 11.8990 -5.6992 5.6289 -0.5714 7.8780
hfenergy: -1226.130446 hartree
pointgroup: C01 [X(C12H15Cl1O4)]
dipole: 0.5496946 -0.303815 0.1630046 debye
polarizability: 186.1898924|-8.4395026|154.2101033|-3.2679771|-9.1252737|120.7567273 unknown
InChI: InChI=1S/C12H15ClO4/c1-14-10-4-3-8(5-11(10)15-2)12-16-7-9(6-13)17-12/h3-5,9,12H,6-7H2,1-2H3
charge 0 multiplicity 1
32 atoms
Cl -4.196056 -1.036133 -2.294805
O  -2.696081 0.096757 1.390993
O  -1.9284 2.089562 0.43964
O  3.036921 1.0940 -0.748678
O  3.433586 -1.461399 -0.197817
C  -3.377745 0.214443 0.066444
C  -1.53339 1.014413 1.351808
C  -2.654128 1.39487 -0.648669
C  -0.253038 0.307334 0.913047
C  -3.248052 -1.127987 -0.653021
C  0.76475 1.054358 0.263863
C  -0.039055 -1.053461 1.204619
C  1.982765 0.445009 -0.09981
C  1.181017 -1.675603 0.845681
C  2.197509 -0.942759 0.195788
C  2.858302 2.515229 -1.056655
C  3.690819 -2.873824 0.093148
H  -4.437422 0.441426 0.274137
H  -1.452502 1.464622 2.35581
H  -1.944548 1.01975 -1.411711
H  -3.340126 2.127113 -1.095822
H  -3.715183 -1.946216 -0.087814
H  -2.20578 -1.365406 -0.910971
H  0.575373 2.108523 0.041088
H  -0.823699 -1.626156 1.708854
H  1.330427 -2.733817 1.079149
H  3.79154 2.81722 -1.553666
H  2.713926 3.112168 -0.135121
H  2.001135 2.675613 -1.739411
H  4.702583 -3.062606 -0.293918
H  2.964135 -3.531233 -0.423179
H  3.663718 -3.072806 1.182403
