program: Gaussian 09
title: 000239554
version: EM64L-G09RevD.01
frameworkgroup: C1[X(C13H18O4)]
method: RPBEPBE
basis: SDD
operation: Freq
keyword: #pfreq=noraman
keyword: PBEPBE/SDD
title: #p freq=noraman PBEPBE/SDD
converged: YES YES NO NO
title: Mulliken charges:
elementType: O O O O C C C C C C C C C C C C C H H H H H H H H H H H H H H H H H H
charge: -0.279828 -0.271299 -0.242182 -0.237829 -0.025823 -0.007551 -0.162480 0.376618 -0.705253 -0.729500 -0.498859 -0.420043 0.223857 -0.320835 0.197259 -0.536931 -0.538844 0.212568 0.215609 0.247073 0.234408 0.236191 0.209201 0.230776 0.211092 0.233635 0.274390 0.261589 0.241914 0.244926 0.219583 0.221993 0.246224 0.219996 0.218354
chargesum: 0.00000
title: Mulliken charges with hydrogens summed into heavy atoms:
elementType: O O O O C C C C C C C C C C C C C
charge: -0.279828 -0.271299 -0.242182 -0.237829 0.186744 0.208059 0.084594 0.376618 -0.025453 -0.053997 -0.224469 -0.158453 0.223857 -0.078920 0.197259 0.149570 0.145730
polarizability: 1.94909187e+02 -2.65766740e+00 1.64228752e+02 8.68701048e+00 1.35750325e+00 1.08636137e+02
1716.lowfreq: -0.0006 -0.0005 0.0003 3.2267 6.6235 11.6727 25.4610 37.5311 52.6107
frequency: 25.0003 37.3141 52.5813 83.2400 97.6820 130.4983 144.9736 174.4523 181.8930 204.8109 219.6264 224.9419 232.3741 257.8170 278.5505 280.2998 323.7667 343.5220 361.6102 375.4813 454.3831 462.5026 478.3349 521.3746 559.3560 571.0410 596.0295 615.2381 696.3966 728.7460 739.9177 774.8327 787.7479 811.3309 822.5878 848.1123 872.2287 896.7516 920.5606 943.9021 981.6466 983.6826 993.6338 1020.5775 1045.6112 1070.2317 1110.7732 1111.1354 1111.8694 1126.0927 1141.6755 1144.5979 1157.7231 1164.7820 1174.7050 1214.0156 1240.9586 1258.4115 1274.6399 1281.2066 1293.2089 1306.7679 1322.9008 1367.8129 1386.6625 1390.3878 1393.6697 1408.5364 1434.7989 1442.9761 1461.5222 1461.9572 1465.8402 1466.3950 1470.7108 1472.3266 1475.5972 1478.5326 1504.4977 1590.8538 1609.4523 2954.9562 2957.2891 2964.3316 2984.2369 2991.6164 2996.9877 3035.4247 3041.6742 3044.0032 3079.1133 3087.8868 3098.5635 3100.3068 3124.4973 3124.8636 3149.4371 3161.2157 3170.0770
redmass: 3.7872 3.4914 3.4882 3.4192 3.2915 4.5014 4.3365 3.2866 2.6395 1.1486 1.2251 1.7781 1.2327 1.6585 2.7919 2.8083 2.6278 4.1459 4.0281 4.0921 4.2327 3.5122 5.1717 3.8254 5.2915 4.6601 4.4940 5.9043 8.0682 5.1633 3.4499 3.1285 2.2926 2.4396 1.9637 2.2826 2.1347 3.6805 3.0751 1.6193 1.2471 7.9118 6.0037 3.3534 2.6048 1.7767 2.7260 1.2665 1.2623 2.0277 1.5719 2.1550 1.4045 1.9684 1.6134 2.3738 1.2228 4.2230 1.4185 1.3170 1.2370 1.1684 1.3233 1.6172 3.8215 1.2383 1.2453 4.6137 1.1829 1.3128 1.0444 1.0548 1.0504 1.0509 1.0941 1.0610 1.0467 1.0481 2.6580 7.5077 6.7339 1.0331 1.0331 1.0837 1.0371 1.0373 1.0855 1.0874 1.1037 1.1036 1.0977 1.0988 1.1009 1.1004 1.0990 1.0993 1.0871 1.0901 1.0957
irintensity: 0.1783 1.6896 0.6822 9.0922 5.8407 0.9670 1.6974 9.7261 0.4861 0.0708 0.4237 0.9047 0.4176 0.5015 0.2239 0.1441 1.8654 1.8003 5.5050 2.9156 1.2966 1.5589 2.9081 4.2401 19.2166 5.5146 8.1569 7.9936 2.3743 29.7274 2.2385 19.5901 14.8210 12.4833 34.9220 2.5247 63.8320 39.2039 8.4769 8.5575 21.2828 33.4409 66.0378 61.7661 134.0568 2.5477 2.5217 0.1843 0.2215 166.3602 12.8554 3.4826 5.1290 1.6199 39.9476 57.7824 1.7536 265.7621 12.7533 2.2171 56.6917 3.5565 2.6971 1.0870 29.8434 26.5375 21.2348 14.0681 15.3956 7.4994 11.0776 0.6909 6.8932 20.9911 76.2413 35.6587 9.2077 12.0328 114.3081 37.2653 29.1049 99.4250 34.4028 20.0408 21.4470 16.6097 72.3908 28.8206 43.7497 56.8167 30.6057 24.5404 2.8434 56.5012 12.0455 37.0235 6.7297 5.7289 7.2886
temp: 298.150 k
press: 1.00000 atm
elementType: 8 8 8 8 6 6 6 6 6 6 6 6 6 6 6 6 6 1 1 1 1 1 1 1 1 1 1 1 1 1 1 1 1 1 1
symmnumber: 1
zpe: 753717.2 jmol-1
zpe.correction: 0.287076 hartree
zpe.thermalcorrener: 0.304598 hartree
zpe.thermalcorrenthalpy: 0.305542 hartree
zpe.thermalcorrgfe: 0.241182 hartree
zpe.sumelectzpe: -805.720059 hartree
zpe.sumelectthermal: -805.702537 hartree
zpe.sumelectthermalent: -805.701593 hartree
zpe.sumelectthermalfe: -805.765953 hartree
dipole: -0.4922 -0.4246 1.9153
dipole: 2.0226
quadrupole: -96.4563 -88.6435 -102.4894
quadrupole: -6.7644 -6.5628 -2.2052
quadrupole: -0.5932 7.2196 -6.6263 -6.7644 -6.5628 -2.2052
hfenergy: -806.0071348 hartree
pointgroup: C01 [X(C13H18O4)]
dipole: 0.2670826 -0.057532 0.7473792 debye
polarizability: 191.8123934|5.983538|160.0031413|-17.6967905|14.0335967|115.9585413 unknown
InChI: InChI=1S/C13H18O4/c1-8-9(2)17-13(16-8)10-5-6-11(14-3)12(7-10)15-4/h5-9,13H,1-4H3
charge 0 multiplicity 1
35 atoms
O  2.350076 1.636636 -0.914211
O  2.428437 -0.681629 -1.288304
O  -2.414596 -2.280124 -0.21438
O  -3.638733 -0.197368 0.871494
C  3.331815 1.068826 0.063474
C  3.071263 -0.466608 0.037873
C  1.583952 0.504488 -1.472201
C  0.218764 0.355353 -0.80045
C  3.148449 1.718672 1.437331
C  4.31856 -1.34032 0.118192
C  -0.425873 -0.909268 -0.817622
C  -0.433941 1.459576 -0.221373
C  -1.707809 -1.071993 -0.254174
C  -1.722526 1.308627 0.345748
C  -2.3697 0.054198 0.337109
C  -1.770847 -3.446223 -0.822073
C  -4.340283 0.933994 1.480489
H  4.338393 1.287177 -0.34468
H  2.341872 -0.729775 0.833337
H  1.502194 0.660378 -2.562364
H  3.284717 2.811538 1.3693
H  2.136222 1.516774 1.829142
H  3.893615 1.324483 2.154444
H  5.009287 -1.099986 -0.708871
H  4.843146 -1.178103 1.077575
H  4.051591 -2.40873 0.049698
H  0.104225 -1.757844 -1.260195
H  0.070346 2.430364 -0.206568
H  -2.214704 2.177222 0.793322
H  -2.488413 -4.268966 -0.688739
H  -0.818365 -3.69333 -0.313172
H  -1.580435 -3.285481 -1.901335
H  -5.298006 0.520035 1.828232
H  -4.526535 1.73917 0.742726
H  -3.775557 1.344338 2.340826
