program: Gaussian 09
title: 000239549
version: EM64L-G09RevD.01
frameworkgroup: C1[X(C9H15ClO4)]
method: RPBEPBE
basis: SDD
operation: Freq
keyword: #p
keyword: freq=noraman
keyword: PBEPBE/SDD
title: #p freq=noraman PBEPBE/SDD
converged: YES YES NO NO
title: Mulliken charges:
elementType: Cl O O O O C C C C C C C C C H H H H H H H H H H H H H H H
charge: -0.057474 -0.291688 -0.278360 -0.266333 -0.258347 0.375280 0.027945 -0.334145 -0.524071 -0.696902 -0.642363 0.283987 -0.262049 -0.663924 0.240649 0.237535 0.218794 0.249747 0.253319 0.234996 0.221821 0.220842 0.299546 0.256784 0.226313 0.232780 0.218747 0.248172 0.228400
chargesum: 0.00000
title: Mulliken charges with hydrogens summed into heavy atoms:
elementType: Cl O O O O C C C C C C C C C
charge: -0.057474 -0.291688 -0.278360 -0.266333 -0.258347 0.375280 0.268594 0.122185 -0.021006 -0.019243 -0.086033 0.283987 0.197044 0.031394
polarizability: 1.30236633e+02 -1.35765702e+00 1.15913685e+02 1.77920416e+00 -2.29181495e+00 1.04969626e+02
1716.lowfreq: -11.9485 -2.4392 -0.0018 -0.0014 0.0004 7.8269 16.0934 33.8181 64.2791
frequency: 15.9792 33.7463 64.2040 73.0983 87.3447 106.3960 120.5347 139.1535 193.3847 196.8535 219.5343 263.3843 279.7758 288.8428 297.8502 328.0597 363.4652 413.8756 431.8246 512.1154 555.5202 612.8519 638.0902 678.2406 687.3840 731.7646 753.5898 794.5990 820.8026 864.2783 883.6099 898.9644 928.4347 950.2003 987.3545 1014.1461 1017.8865 1051.1723 1081.9838 1093.0560 1100.8391 1103.6899 1156.6137 1161.5258 1167.9096 1200.8417 1223.3630 1228.3874 1256.7951 1278.5246 1305.5144 1332.0147 1342.0649 1362.8191 1363.9272 1383.2111 1392.3698 1417.3127 1430.9388 1457.8895 1458.7617 1460.2263 1464.6318 1467.1154 1484.7779 1646.8182 2993.8854 2997.6810 2999.5096 3015.5320 3019.6823 3031.7837 3057.7116 3078.2947 3089.0807 3093.1636 3094.5340 3101.3980 3110.9019 3120.7251 3150.6567
redmass: 5.7958 5.6141 3.5891 4.4811 4.3674 3.3608 3.5911 3.7202 1.0768 1.8296 1.7232 3.3459 2.9829 3.4199 3.9167 3.3470 2.8791 3.4103 2.5423 4.0356 3.7604 3.3258 4.2572 4.5662 6.5062 6.3173 3.0484 1.6848 2.1154 3.6070 2.8579 1.6802 1.8929 2.0109 6.1976 2.6674 2.8516 2.1498 1.9434 2.3437 2.6639 2.4058 1.7585 1.9579 1.9623 1.2693 2.3865 1.2929 1.1994 1.1188 1.2986 1.2213 1.4840 1.5044 1.3997 1.2329 1.2323 1.0842 1.1043 1.0663 1.0832 1.0492 1.0438 1.0874 1.0518 8.9408 1.0361 1.0643 1.0561 1.0618 1.0574 1.0598 1.0579 1.0974 1.0973 1.1089 1.1030 1.0998 1.1006 1.1062 1.1091
irintensity: 0.2245 1.5405 0.3171 5.5124 0.9365 4.3813 10.9223 1.5699 0.2713 2.3576 2.6783 1.9075 0.7369 2.4875 0.6160 18.4774 7.8765 7.0229 4.8660 24.2508 6.8579 8.7316 1.0516 9.5719 54.9682 7.7956 17.7628 5.5923 4.8371 37.0665 18.9412 7.7862 12.5406 9.8204 48.2005 58.5474 63.1546 1.1443 90.8611 118.4170 18.5551 75.5353 3.8497 139.5646 61.0876 10.7433 77.8458 6.6015 7.6040 3.8069 6.3255 14.4515 72.6175 42.8745 6.8697 21.2586 22.4799 28.1178 11.7169 10.8716 7.0946 13.7314 12.4540 12.4427 12.3084 178.8587 19.8232 20.6289 25.9283 4.7214 42.5848 27.8823 16.9946 1.2450 34.0449 22.4422 0.8988 18.5763 23.7345 33.2744 5.3411
temp: 298.150 k
press: 1.00000 atm
elementType: 17 8 8 8 8 6 6 6 6 6 6 6 6 6 1 1 1 1 1 1 1 1 1 1 1 1 1 1 1
symmnumber: 1
zpe: 610554.7 jmol-1
zpe.correction: 0.232548 hartree
zpe.thermalcorrener: 0.248370 hartree
zpe.thermalcorrenthalpy: 0.249314 hartree
zpe.thermalcorrgfe: 0.187149 hartree
zpe.sumelectzpe: -1111.780101 hartree
zpe.sumelectthermal: -1111.764279 hartree
zpe.sumelectthermalent: -1111.763335 hartree
zpe.sumelectthermalfe: -1111.825500 hartree
dipole: -2.3677 0.7877 1.1723
dipole: 2.7569
quadrupole: -84.0891 -89.5871 -90.7232
quadrupole: 8.7603 7.4952 -5.4111
quadrupole: 4.0441 -1.4540 -2.5900 8.7603 7.4952 -5.4111
hfenergy: -1112.012649 hartree
pointgroup: C01 [X(C9H15Cl1O4)]
dipole: 0.8315525 0.6961766 -0.0182404 debye
polarizability: 126.3537521|2.612132|113.5319267|6.683681|7.2762387|111.2342655 unknown
InChI: InChI=1S/C9H15ClO4/c1-3-12-8(11)4-9(2)13-6-7(5-10)14-9/h7H,3-6H2,1-2H3
charge 0 multiplicity 1
29 atoms
Cl -2.660309 -3.398751 -1.177807
O  -1.656687 -0.601691 0.249405
O  -1.211364 1.539681 -0.679777
O  2.205714 -0.308522 1.52231
O  1.240675 -0.395377 -0.594573
C  -1.277219 0.782276 0.595176
C  -2.08425 -0.633568 -1.167978
C  -1.363308 0.58961 -1.798321
C  0.092786 0.753619 1.303342
C  -2.353167 1.439026 1.468419
C  -1.632693 -1.943079 -1.794671
C  1.189466 -0.034598 0.603313
C  3.41138 -1.026663 0.999397
C  4.41129 -0.037097 0.39502
H  -3.185573 -0.525005 -1.221684
H  -0.368042 0.312565 -2.187448
H  -1.971615 1.086483 -2.571773
H  -0.021408 0.345552 2.322486
H  0.443495 1.796982 1.417165
H  -3.314807 1.439399 0.929644
H  -2.475283 0.882715 2.413355
H  -2.080739 2.484355 1.696986
H  -0.588917 -2.159164 -1.527438
H  -1.77513 -1.935084 -2.886592
H  3.814784 -1.532643 1.890735
H  3.079839 -1.771329 0.25479
H  5.330258 -0.573523 0.093874
H  3.988985 0.45043 -0.499531
H  4.690041 0.738601 1.128875
