program: Gaussian 09
title: 000239547
version: EM64L-G09RevD.01
frameworkgroup: C1[X(C19H26OS)]
method: RPBEPBE
basis: SDD
operation: Freq
keyword: #p
keyword: freq=noraman
keyword: PBEPBE/SDD
title: #p freq=noraman PBEPBE/SDD
converged: YES YES NO NO
title: Mulliken charges:
elementType: S O C C C C C C C C C C C C C C C C C C C H H H H H H H H H H H H H H H H H H H H H H H H H H
charge: 0.137092 -0.229769 0.306630 -0.263075 -0.256313 -0.745859 -0.736026 -0.271502 -0.112227 0.362633 -0.791262 -0.794126 -0.880154 0.572344 -0.556896 -0.423843 0.341552 -0.413953 0.325174 -0.819008 -0.808893 0.259579 0.255045 0.212400 0.213376 0.257840 0.212426 0.221888 0.225754 0.198637 0.219308 0.217492 0.227946 0.220062 0.222831 0.236965 0.269597 0.302923 0.265221 0.231347 0.227807 0.235120 0.223958 0.222539 0.224671 0.227570 0.225183
chargesum: 0.00000
title: Mulliken charges with hydrogens summed into heavy atoms:
elementType: S O C C C C C C C C C C C C C C C C C C C
charge: 0.137092 -0.229769 0.306630 -0.003496 -0.001268 -0.062243 -0.075959 -0.072865 -0.112227 0.362633 -0.126516 -0.114268 -0.307634 0.572344 -0.291676 -0.192496 0.341552 -0.186146 0.325174 -0.137391 -0.131469
polarizability: 3.45716456e+02 7.80237397e+00 2.15415364e+02 -1.87779315e+01 1.03433549e+01 1.75746430e+02
1716.lowfreq: -8.0517 -5.4396 -2.8214 0.0003 0.0011 0.0016 10.7269 17.7363 20.2849
frequency: 9.9307 17.5131 20.1539 21.8563 44.4284 79.6505 85.4251 102.1555 106.0965 113.2037 129.1897 149.6300 152.8961 160.2709 170.0054 186.3181 190.5691 214.5363 240.7465 243.6972 265.2268 280.1440 288.1620 307.0167 335.0831 339.1103 360.7091 386.6983 413.1091 430.2547 441.7025 452.7930 466.4309 475.5107 499.2757 500.6483 539.9141 566.4933 609.8209 646.9038 680.8107 721.3929 734.1743 741.4331 772.4842 800.4416 824.6187 831.9015 856.8749 873.1251 882.6160 917.6518 938.8338 949.1408 952.8452 953.3770 967.0775 990.4969 993.2692 995.0762 1003.3283 1022.7292 1031.0184 1045.8239 1052.8194 1072.2342 1078.3342 1082.6332 1121.6807 1129.5067 1160.0206 1163.2273 1174.6363 1194.7037 1218.6040 1242.0744 1248.8858 1260.6498 1286.7708 1294.4765 1325.2049 1362.7793 1375.5869 1386.2040 1390.5039 1391.9548 1398.0221 1401.5281 1404.6273 1411.4885 1412.5410 1440.4083 1453.6192 1461.5209 1462.7052 1466.0404 1469.5419 1470.4726 1472.1652 1475.6095 1476.2559 1477.2912 1482.9378 1491.3500 1500.9389 1584.8528 1597.4072 1624.0668 1683.3557 2957.3743 2965.8070 2966.6442 2968.2923 2975.4254 2978.8125 3027.7646 3028.1930 3033.1010 3037.1390 3041.1423 3060.3535 3067.1545 3078.1639 3081.3238 3082.2091 3085.1220 3093.3335 3097.1759 3098.8726 3108.6685 3112.6858 3119.0342 3124.8205 3127.5358 3137.6138
redmass: 4.1035 3.9356 3.4089 3.5318 3.8629 3.1058 5.3436 4.1577 1.1619 1.0734 2.7345 2.2766 2.1325 1.2519 1.4619 2.9854 1.3450 2.5519 1.5431 2.3863 2.9775 2.7087 2.5752 2.3133 3.1438 3.6550 2.9134 2.9878 2.4855 2.6939 2.8065 2.9001 5.1216 4.1214 2.9347 3.3924 4.3507 5.2342 4.1790 4.2929 5.5417 4.4960 3.1669 3.5033 6.0745 3.5559 3.4653 1.4022 1.7156 2.3662 1.9920 1.3862 2.7494 1.3849 1.3638 1.3518 1.4770 1.2787 1.6019 1.4553 1.5155 1.6084 1.4547 1.6714 1.6516 1.3831 2.0132 1.7159 1.7782 1.9593 1.4486 2.6171 1.2071 1.9803 1.8684 2.2981 1.1848 3.5553 1.7052 1.4790 1.6729 1.7411 5.2251 1.2321 1.2884 1.2398 1.2955 1.2631 1.2992 1.9407 2.4515 1.1284 1.0496 1.0479 1.0529 1.0507 1.2013 1.0515 1.0507 1.0480 1.0806 1.1751 1.1305 1.0596 2.4346 6.3945 8.4583 6.3321 6.2850 1.0373 1.0390 1.0375 1.0383 1.0366 1.0365 1.0592 1.0968 1.0963 1.0969 1.0967 1.0992 1.0988 1.0983 1.0983 1.0980 1.0978 1.0888 1.0962 1.0983 1.1049 1.0878 1.0888 1.0921 1.0879 1.0970
irintensity: 0.1200 0.3786 0.1350 0.0599 0.6012 1.8873 0.6062 1.3133 0.1777 0.0003 0.0941 1.1546 0.9285 1.5456 1.0437 1.2623 0.8734 3.5319 2.4997 1.8998 7.7367 0.0253 1.2185 10.3545 2.8173 2.0553 0.7038 9.4030 1.8473 1.2949 4.7523 1.0137 12.5017 4.2493 5.2177 22.5689 1.6492 12.4801 0.7442 35.8787 8.7774 19.7057 5.6186 5.0928 81.4085 28.3021 6.0558 21.3272 24.9075 20.5695 8.6258 9.2344 2.0581 3.2060 1.0386 8.0369 43.0097 1.4024 1.7555 28.3551 10.6350 32.1334 17.3950 18.7908 0.1370 35.6773 194.4437 91.9554 67.9776 7.1561 6.6032 30.3742 2.9994 16.4982 2.8132 30.0851 6.3038 9.3350 18.0918 0.5016 14.8018 83.9530 1.5870 15.5987 34.0241 5.9419 14.9154 17.5636 18.2315 33.3385 1.0882 20.1412 1.6007 0.2000 13.4684 7.7651 24.1850 20.9331 10.0095 28.6986 1.5844 1.5240 19.4794 14.6073 29.7660 7.0976 93.4295 1.0539 11.3629 51.2359 68.7263 57.8803 15.0405 21.8566 50.5605 17.7565 11.3642 39.1866 45.1111 0.8060 13.3987 48.4514 22.7055 33.2245 27.3771 10.1692 27.6845 31.1829 9.8952 1.4264 18.3205 7.9094 7.9589 9.2619 24.7811
temp: 298.150 k
press: 1.00000 atm
elementType: 16 8 6 6 6 6 6 6 6 6 6 6 6 6 6 6 6 6 6 6 6 1 1 1 1 1 1 1 1 1 1 1 1 1 1 1 1 1 1 1 1 1 1 1 1 1 1
symmnumber: 1
zpe: 1035426.7 jmol-1
zpe.correction: 0.394373 hartree
zpe.thermalcorrener: 0.419077 hartree
zpe.thermalcorrenthalpy: 0.420021 hartree
zpe.thermalcorrgfe: 0.336500 hartree
zpe.sumelectzpe: -1211.301225 hartree
zpe.sumelectthermal: -1211.276521 hartree
zpe.sumelectthermalent: -1211.275577 hartree
zpe.sumelectthermalfe: -1211.359098 hartree
dipole: -0.9365 1.2114 -0.6294
dipole: 1.6555
quadrupole: -113.0657 -129.1412 -136.3082
quadrupole: 2.3517 -0.6195 -0.4907
quadrupole: 13.1060 -2.9695 -10.1365 2.3517 -0.6195 -0.4907
hfenergy: -1211.6955982 hartree
pointgroup: C01 [X(C19H26O1S1)]
dipole: 0.3512172 0.3558563 0.4174187 debye
polarizability: 346.3266871|3.3404361|217.0256154|-17.3089995|6.1779363|173.5259474 unknown
InChI: InChI=1S/C19H26OS/c1-12(2)9-16-17(19(16,5)6)18(20)21-11-15-8-7-13(3)14(4)10-15/h7-10,16-17H,11H2,1-6H3
charge 0 multiplicity 1
47 atoms
S  -0.102219 -1.947629 0.219873
O  0.58973 0.306987 -1.202905
C  2.390861 1.21146 1.266567
C  3.28093 0.564679 0.19655
C  2.006771 -0.204876 0.717216
C  1.557641 2.426142 0.863537
C  2.852781 1.242878 2.723477
C  4.636641 0.021615 0.461531
C  0.881075 -0.420868 -0.217031
C  5.646873 -0.130726 -0.447571
C  6.99382 -0.689619 -0.019688
C  5.547046 0.221632 -1.920753
C  -1.422423 -1.872533 -1.17059
C  -2.721764 -1.246568 -0.729311
C  -2.87872 0.163553 -0.74382
C  -3.81134 -2.043368 -0.303014
C  -4.08349 0.784816 -0.34207
C  -5.020246 -1.434778 0.099196
C  -5.178817 -0.027581 0.088803
C  -4.208801 2.297949 -0.375905
C  -6.489413 0.601681 0.52634
H  3.11289 0.972904 -0.806969
H  2.19235 -1.031929 1.411254
H  0.665277 2.520976 1.51077
H  2.161861 3.345756 0.979768
H  1.215987 2.361295 -0.182396
H  3.373164 0.31857 3.02841
H  3.543789 2.091141 2.888829
H  1.983929 1.374275 3.394412
H  4.841225 -0.284398 1.497973
H  7.236599 -1.613885 -0.581562
H  7.809338 0.030653 -0.23168
H  7.019258 -0.927653 1.057907
H  6.30505 0.983312 -2.191954
H  5.759046 -0.669084 -2.545049
H  4.557913 0.606883 -2.214648
H  -1.5418 -2.921342 -1.484326
H  -0.93102 -1.289652 -1.968514
H  -2.035224 0.78183 -1.075167
H  -3.715228 -3.135981 -0.284628
H  -5.858951 -2.062148 0.425017
H  -3.272991 2.767478 -0.722907
H  -5.022836 2.624923 -1.051794
H  -4.444297 2.709982 0.624675
H  -6.938481 1.212482 -0.280816
H  -7.225012 -0.167826 0.816472
H  -6.347776 1.277595 1.392092
