program: Gaussian 09
title: 000239545
version: EM64L-G09RevD.01
frameworkgroup: C1[X(C22H32O2)]
method: RPBEPBE
basis: SDD
operation: Freq
keyword: #pfreq=noraman
keyword: PBEPBE/SDD
title: #p freq=noraman PBEPBE/SDD
converged: YES YES NO NO
title: Mulliken charges:
elementType: O O C C C C C C C C C C C C C C C C C C C C C C H H H H H H H H H H H H H H H H H H H H H H H H H H H H H H H H
charge: -0.340871 -0.217513 0.324497 -0.259921 -0.361419 -0.737895 -0.751542 -0.266930 0.178916 0.366917 -0.791675 -0.793504 -0.050695 0.473412 0.455994 -0.222655 -0.225103 -0.425218 -0.413917 -0.279895 -0.713971 -0.704796 -0.696947 -0.712356 0.254444 0.250438 0.221580 0.215652 0.223292 0.260143 0.215054 0.205838 0.198662 0.217565 0.218620 0.228516 0.220178 0.222056 0.230350 0.236431 0.229160 0.234118 0.232579 0.221223 0.209018 0.212436 0.224199 0.262501 0.205979 0.205970 0.210622 0.207954 0.250146 0.224877 0.211627 0.205863
chargesum: 0.00000
title: Mulliken charges with hydrogens summed into heavy atoms:
elementType: O O C C C C C C C C C C C C C C C C C C C C C C
charge: -0.340871 -0.217513 0.324497 -0.005477 -0.110980 -0.077371 -0.070506 -0.068268 0.178916 0.366917 -0.126974 -0.120921 -0.050695 0.473412 0.455994 0.013776 0.004057 -0.191101 -0.181338 -0.058672 -0.068319 -0.030347 -0.028226 -0.069989
polarizability: 3.01614492e+02 1.77100008e+01 2.73008976e+02 -1.08515197e+00 -4.58008556e+00 1.78975671e+02
1716.lowfreq: -8.1355 -4.7784 -0.0008 -0.0008 -0.0006 6.5663 13.7868 20.5609 29.6962
frequency: 13.7370 20.1025 29.6605 30.3076 37.9580 46.0179 57.8547 70.0140 85.3833 114.8704 123.3306 126.1431 127.3530 134.7162 167.6229 170.5968 184.9394 207.4351 213.5400 218.0726 227.0401 229.7921 237.7583 246.9069 260.6332 261.9279 272.7053 293.3590 309.8023 312.1637 322.8894 362.3375 400.3382 407.4975 409.5599 428.0297 435.5020 448.9362 501.2058 505.6753 508.5088 526.4002 532.8505 581.6104 605.5706 628.5660 643.0053 704.4087 717.3656 742.9476 786.6108 802.8921 812.1980 818.4787 823.6609 858.8189 868.8522 886.4102 909.8454 911.3868 919.6360 923.7224 941.2278 949.2818 956.8102 958.2849 959.7702 977.5220 978.3156 991.3073 1001.8635 1037.1162 1042.0461 1046.4717 1061.1234 1071.8472 1079.6409 1081.8529 1115.0034 1116.8287 1121.6830 1136.3538 1152.8167 1158.5588 1170.7889 1177.6548 1189.1062 1211.7784 1239.1382 1260.5472 1262.3429 1283.0952 1306.1241 1312.4603 1320.7901 1324.8458 1330.9373 1356.2661 1377.8004 1378.1850 1386.8513 1389.1543 1390.8726 1396.4588 1396.9338 1400.1560 1401.4209 1411.2034 1442.6236 1454.4702 1457.9181 1464.1247 1466.5006 1467.3108 1467.7586 1468.9726 1469.4619 1470.9170 1471.0464 1475.6162 1480.0073 1482.4004 1484.8710 1489.1359 1490.0056 1490.4203 1593.0977 1605.9389 1632.9726 1684.3576 2956.5445 2963.7723 2972.4161 2973.8008 2974.4790 2975.8807 2976.6665 2978.5023 3011.8790 3022.9852 3027.3692 3031.3088 3054.9224 3064.4861 3065.1059 3066.5196 3072.7583 3073.6640 3076.9413 3077.4949 3077.9048 3080.5701 3083.3417 3089.1574 3091.7453 3093.4097 3107.8511 3122.4387 3132.9599 3135.7421 3144.8382 3156.0093
redmass: 3.7451 3.3075 3.2638 2.8275 2.9263 3.5179 4.8732 3.6938 4.2317 3.0252 2.5466 1.2061 3.0213 2.0327 2.0449 1.4506 1.2641 1.7268 1.1526 1.8222 1.6929 1.4442 1.2255 1.4194 2.0653 1.8275 2.6479 3.0262 3.1362 3.1400 2.9527 2.5812 2.8673 2.7375 4.5285 2.5301 3.0702 2.7571 3.5903 3.8926 3.2867 4.3020 3.8738 2.9144 3.8592 4.1696 3.2777 4.0283 4.7130 4.6962 2.2099 3.5583 2.7853 4.0213 3.4312 1.6988 3.4238 2.6731 2.4732 1.6776 1.2079 1.2237 2.1374 1.3909 1.4451 1.4620 1.3496 1.4365 1.3384 1.2600 1.4104 1.5071 1.7983 1.6682 1.4687 1.4214 2.4111 1.8720 2.6476 2.6337 1.8439 2.0021 2.5882 2.3420 1.7061 2.2714 1.2444 2.8452 2.2950 2.2547 2.0971 1.4875 1.4746 1.3943 1.6683 1.6619 1.5349 1.7840 1.1909 1.1939 2.6488 1.2610 1.2737 1.2526 1.2471 1.2208 1.4922 1.7332 2.5154 1.0546 2.0323 1.0505 1.0551 1.0710 1.0726 1.0587 1.0631 1.0506 1.0486 1.0862 1.0512 1.0515 1.1184 1.0794 1.0731 1.0811 5.7796 7.7778 10.6641 6.3470 1.0374 1.0387 1.0349 1.0350 1.0378 1.0353 1.0353 1.0366 1.0837 1.0838 1.0969 1.0963 1.0985 1.0999 1.0998 1.0989 1.0990 1.0990 1.1002 1.0982 1.0993 1.0982 1.0998 1.1002 1.0944 1.0907 1.0972 1.0849 1.0885 1.0909 1.0871 1.0990
irintensity: 0.0382 0.0476 0.2877 0.0542 0.1274 0.2983 0.3591 0.7368 1.5976 1.3040 1.0542 0.0070 0.0737 0.2246 1.7873 0.1510 0.6225 0.0761 0.2425 0.7292 0.2147 0.2357 0.5537 0.4638 2.0855 0.8813 0.9848 2.2397 1.6064 0.5236 0.3318 0.9386 3.4359 2.7621 7.0535 0.2427 4.6456 4.0172 12.9656 8.6688 2.9293 3.2267 0.3374 0.1897 2.9710 0.3541 1.2248 7.2867 7.6413 5.6319 36.4560 3.1669 21.2074 2.6238 9.4814 23.2834 57.6241 9.8973 25.8565 11.0696 1.8254 3.6239 19.3561 0.8989 0.2252 2.1446 0.1457 39.3269 1.6009 2.9715 6.4573 7.5164 4.5120 53.7791 23.0570 3.2964 106.7344 62.9520 1.0792 4.1592 112.0122 127.3516 47.0202 4.9687 3.0182 34.5170 5.9806 191.2539 5.9866 10.4177 6.6029 29.3593 1.8970 4.3566 1.7912 0.6594 9.4245 7.3164 14.1607 26.7991 10.1295 4.4932 35.9148 13.8376 16.7480 4.4303 28.3254 2.5815 25.1575 0.9567 2.7747 11.1748 7.3109 6.2651 3.2847 6.7568 5.0262 13.3123 22.7331 3.2046 8.2160 11.9715 12.9713 20.5150 26.3977 7.8603 6.6680 5.6830 272.5382 2.9880 47.9404 52.4686 26.2787 22.8312 31.9782 57.5300 30.3595 48.3465 5.4036 4.1084 6.3196 45.0109 25.8513 0.3006 1.9031 35.6565 78.4282 85.0377 19.3581 19.5251 52.2167 31.3528 33.1992 26.0077 18.7848 49.4358 10.7393 0.7840 7.2397 23.3484 10.9151 32.5838
temp: 298.150 k
press: 1.00000 atm
elementType: 8 8 6 6 6 6 6 6 6 6 6 6 6 6 6 6 6 6 6 6 6 6 6 6 1 1 1 1 1 1 1 1 1 1 1 1 1 1 1 1 1 1 1 1 1 1 1 1 1 1 1 1 1 1 1 1
symmnumber: 1
zpe: 1261590.7 jmol-1
zpe.correction: 0.480515 hartree
zpe.thermalcorrener: 0.508840 hartree
zpe.thermalcorrenthalpy: 0.509785 hartree
zpe.thermalcorrgfe: 0.419637 hartree
zpe.sumelectzpe: -1006.120349 hartree
zpe.sumelectthermal: -1006.092023 hartree
zpe.sumelectthermalent: -1006.091078 hartree
zpe.sumelectthermalfe: -1006.181226 hartree
dipole: 2.0399 -0.1025 -1.9907
dipole: 2.8521
quadrupole: -133.2389 -135.9331 -156.4801
quadrupole: -0.5922 2.9182 0.5391
quadrupole: 8.6452 5.9509 -14.5961 -0.5922 2.9182 0.5391
hfenergy: -1006.600863 hartree
pointgroup: C01 [X(C22H32O2)]
dipole: -0.8767096 0.1476193 -0.6846424 debye
polarizability: 281.566571|29.341576|253.675299|-1.6596401|50.8475082|218.3572694 unknown
InChI: InChI=1S/C22H32O2/c1-13(2)12-18-19(22(18,7)8)21(23)24-20-16(14(3)4)10-9-11-17(20)15(5)6/h9-12,14-15,18-19H,1-8H3
charge 0 multiplicity 1
56 atoms
O  0.146168 0.482003 0.100045
O  0.452032 -0.443972 2.232759
C  -2.800156 1.037843 0.977072
C  -2.694974 -0.231759 0.117593
C  -1.804672 -0.088621 1.406849
C  -4.002715 1.228855 1.903171
C  -2.284669 2.348639 0.386678
C  -3.741273 -1.283824 0.054013
C  -0.325116 -0.042894 1.337377
C  -3.97567 -2.141317 -0.984824
C  -5.094463 -3.166614 -0.904102
C  -3.180811 -2.174195 -2.278446
C  1.569868 0.511193 -0.14291
C  2.334195 1.591525 0.364192
C  2.110377 -0.523635 -0.949351
C  1.727906 2.681167 1.253015
C  1.255752 -1.703317 -1.422245
C  3.711832 1.617587 0.030675
C  3.491514 -0.448977 -1.255724
C  4.286818 0.611248 -0.772216
C  1.958689 4.098043 0.665135
C  2.282541 2.576178 2.699897
C  1.549027 -2.957036 -0.549899
C  1.448876 -2.015327 -2.927357
H  -2.114622 -0.080285 -0.798241
H  -2.13053 -0.664852 2.278877
H  -4.869457 1.613265 1.332891
H  -4.313872 0.294644 2.401589
H  -3.761659 1.963632 2.693551
H  -1.418902 2.191133 -0.275318
H  -3.089679 2.831774 -0.198834
H  -1.984872 3.050537 1.188788
H  -4.386648 -1.376198 0.939741
H  -5.825272 -3.025699 -1.725692
H  -4.697651 -4.196399 -1.008778
H  -5.64067 -3.106285 0.053184
H  -2.732309 -3.176544 -2.429271
H  -3.843235 -1.992675 -3.148209
H  -2.365973 -1.433079 -2.314137
H  0.636053 2.518492 1.301308
H  0.194143 -1.433409 -1.270816
H  4.337491 2.434899 0.407194
H  3.946625 -1.229397 -1.875655
H  5.353766 0.650838 -1.018251
H  3.035814 4.341653 0.60906
H  1.477015 4.860808 1.304968
H  1.538817 4.184573 -0.353562
H  2.083513 1.575256 3.120355
H  1.807511 3.333782 3.351209
H  3.374881 2.749189 2.718498
H  2.60038 -3.279741 -0.669143
H  0.895618 -3.798267 -0.848324
H  1.379493 -2.744225 0.520513
H  1.249118 -1.12591 -3.552043
H  0.758238 -2.820818 -3.239921
H  2.476803 -2.359888 -3.145325
